Build failed in Jenkins: master-osmo-bsc » a1=default,a2=default,a3=default,a4=default,osmocom-master-debian9 #15353

jenkins at lists.osmocom.org jenkins at lists.osmocom.org
Wed Aug 18 00:55:11 UTC 2021


See <https://jenkins.osmocom.org/jenkins/job/master-osmo-bsc/a1=default,a2=default,a3=default,a4=default,label=osmocom-master-debian9/15353/display/redirect>

Changes:


------------------------------------------
[...truncated 884.47 KB...]
ok
test_unknown_command (__main__.TestVTY) ... Connecting socket failed, retrying...
Socket: in 2 tries, connected to 127.0.0.1:4242 <socket.socket fd=5, family=AddressFamily.AF_INET, type=SocketKind.SOCK_STREAM, proto=0, laddr=('127.0.0.1', 53204), raddr=('127.0.0.1', 4242)> (1 sockets open)
Socket: closing 127.0.0.1:4242 <socket.socket fd=5, family=AddressFamily.AF_INET, type=SocketKind.SOCK_STREAM, proto=0, laddr=('127.0.0.1', 53204), raddr=('127.0.0.1', 4242)> (0 sockets open)
Launch: ./src/osmo-bsc/osmo-bsc -c /build/doc/examples/osmo-bsc/osmo-bsc.cfg from /build
Launching: PWD=/build './src/osmo-bsc/osmo-bsc' '-c' '/build/doc/examples/osmo-bsc/osmo-bsc.cfg'

> ls -l /proc/15518/fd
total 0
lr-x------ 1 build build 64 Aug 18 00:55 0 -> pipe:[465469171]
l-wx------ 1 build build 64 Aug 18 00:55 1 -> pipe:[465469172]
l-wx------ 1 build build 64 Aug 18 00:55 2 -> pipe:[465469173]
l-wx------ 1 build build 64 Aug 18 00:55 3 -> /dev/null


> ss -tn
State      Recv-Q Send-Q Local Address:Port               Peer Address:Port              


> ss -tln
State      Recv-Q Send-Q Local Address:Port               Peer Address:Port              


> ps xua | grep osmo
build    15518 14.0  0.0  53668 20744 ?        S    00:55   0:00 /usr/bin/python3 /usr/local/bin/osmotestvty.py -p /build -w /build -v
build    15541  0.0  0.0 21474986304 30872 ?   R    00:55   0:00 ./src/osmo-bsc/osmo-bsc -c /build/doc/examples/osmo-bsc/osmo-bsc.cfg
build    15548  0.0  0.0   4280   740 ?        S    00:55   0:00 /bin/sh -c ps xua | grep osmo
build    15550  0.0  0.0  12784   968 ?        S    00:55   0:00 grep osmo

ok

----------------------------------------------------------------------
Ran 3 tests in 0.876s

OK
Connecting socket failed, retrying...
Socket: in 2 tries, connected to 127.0.0.1:4242 <socket.socket fd=5, family=AddressFamily.AF_INET, type=SocketKind.SOCK_STREAM, proto=0, laddr=('127.0.0.1', 53216), raddr=('127.0.0.1', 4242)> (1 sockets open)
Socket: closing 127.0.0.1:4242 <socket.socket fd=5, family=AddressFamily.AF_INET, type=SocketKind.SOCK_STREAM, proto=0, laddr=('127.0.0.1', 53216), raddr=('127.0.0.1', 4242)> (0 sockets open)
osmotestconfig.py -p /build -w /build -v
Verifying src/osmo-bsc/osmo-bsc -c /build/doc/examples/osmo-bsc/osmo-bsc.cfg, test verify_doc
Opening /dev/null
Launching: PWD=/build 'src/osmo-bsc/osmo-bsc' '-c' '/build/doc/examples/osmo-bsc/osmo-bsc.cfg'

> ls -l /proc/15552/fd
total 0
lr-x------ 1 build build 64 Aug 18 00:55 0 -> pipe:[465469171]
l-wx------ 1 build build 64 Aug 18 00:55 1 -> pipe:[465469172]
l-wx------ 1 build build 64 Aug 18 00:55 2 -> pipe:[465469173]
l-wx------ 1 build build 64 Aug 18 00:55 3 -> /dev/null


> ss -tn
Warning: doc/examples/osmo-bsc/osmo-bsc-minimal.cfg is not being tested
Warning: doc/examples/osmo-bsc/siemens/osmo-bsc.bs11.cfg is not being tested
Warning: doc/examples/osmo-bsc/ericsson/osmo-bsc.rbs2308.cfg is not being tested
Warning: doc/examples/osmo-bsc/ericsson/osmo-bsc.dug20-rus02-4trx.cfg is not being tested
Warning: doc/examples/osmo-bsc/ericsson/osmo-bsc.dug20-rus02-8trx.cfg is not being tested
Warning: doc/examples/osmo-bsc/ericsson/osmo-bsc.dug20-rus01-4trx.cfg is not being tested
Warning: doc/examples/osmo-bsc/nokia/osmo-bsc.insite.cfg is not being tested
State      Recv-Q Send-Q Local Address:Port               Peer Address:Port              


> ss -tln
State      Recv-Q Send-Q Local Address:Port               Peer Address:Port              


> ps xua | grep osmo
build    15552  0.0  0.0  53808 20748 ?        S    00:55   0:00 /usr/bin/python3 /usr/local/bin/osmotestconfig.py -p /build -w /build -v
build    15553  0.0  0.0 21474986304 31516 ?   R    00:55   0:00 src/osmo-bsc/osmo-bsc -c /build/doc/examples/osmo-bsc/osmo-bsc.cfg
build    15560  0.0  0.0   4280   744 ?        S    00:55   0:00 /bin/sh -c ps xua | grep osmo
build    15562  0.0  0.0  12784   988 ?        S    00:55   0:00 grep osmo

Connecting socket failed, retrying...
Socket: in 2 tries, connected to 127.0.0.1:4242 <socket.socket fd=5, family=AddressFamily.AF_INET, type=SocketKind.SOCK_STREAM, proto=0, laddr=('127.0.0.1', 53234), raddr=('127.0.0.1', 4242)> (1 sockets open)
Terminating took 0.475s
Socket: closing 127.0.0.1:4242 <socket.socket fd=5, family=AddressFamily.AF_INET, type=SocketKind.SOCK_STREAM, proto=0, laddr=('127.0.0.1', 53234), raddr=('127.0.0.1', 4242)> (0 sockets open)
Verifying src/osmo-bsc/osmo-bsc -c /build/writtenconfig/osmo-bsc.cfgpoopg9l1, test write_config
Launching: PWD=/build 'src/osmo-bsc/osmo-bsc' '-c' '/build/writtenconfig/osmo-bsc.cfgpoopg9l1'

> ls -l /proc/15552/fd
total 0
lr-x------ 1 build build 64 Aug 18 00:55 0 -> pipe:[465469171]
l-wx------ 1 build build 64 Aug 18 00:55 1 -> pipe:[465469172]
l-wx------ 1 build build 64 Aug 18 00:55 2 -> pipe:[465469173]
l-wx------ 1 build build 64 Aug 18 00:55 3 -> /dev/null
Documentation error (missing docs): 
<command id='no mgw reset-endpoint NAME'>
        <param name='NAME' doc='(null)' />



> ss -tn
State      Recv-Q Send-Q Local Address:Port               Peer Address:Port              


> ss -tln
State      Recv-Q Send-Q Local Address:Port               Peer Address:Port              


> ps xua | grep osmo
build    15552 14.0  0.0  54232 21456 ?        S    00:55   0:00 /usr/bin/python3 /usr/local/bin/osmotestconfig.py -p /build -w /build -v
build    15564  0.0  0.0 21474986468 35240 ?   R    00:55   0:00 src/osmo-bsc/osmo-bsc -c /build/writtenconfig/osmo-bsc.cfgpoopg9l1
build    15571  0.0  0.0   4280   696 ?        S    00:55   0:00 /bin/sh -c ps xua | grep osmo
build    15573  0.0  0.0  12784  1012 ?        S    00:55   0:00 grep osmo

Connecting socket failed, retrying...
Socket: in 2 tries, connected to 127.0.0.1:4242 <socket.socket fd=5, family=AddressFamily.AF_INET, type=SocketKind.SOCK_STREAM, proto=0, laddr=('127.0.0.1', 53276), raddr=('127.0.0.1', 4242)> (1 sockets open)
Terminating took 0.168s
Socket: closing 127.0.0.1:4242 <socket.socket fd=5, family=AddressFamily.AF_INET, type=SocketKind.SOCK_STREAM, proto=0, laddr=('127.0.0.1', 53276), raddr=('127.0.0.1', 4242)> (0 sockets open)
Verifying src/osmo-bsc/osmo-bsc -c /build/writtenconfig/osmo-bsc.cfgpoopg9l1, test token_vty_command
Launching: PWD=/build 'src/osmo-bsc/osmo-bsc' '-c' '/build/writtenconfig/osmo-bsc.cfgpoopg9l1'

> ls -l /proc/15552/fd
total 0
lr-x------ 1 build build 64 Aug 18 00:55 0 -> pipe:[465469171]
l-wx------ 1 build build 64 Aug 18 00:55 1 -> pipe:[465469172]
l-wx------ 1 build build 64 Aug 18 00:55 2 -> pipe:[465469173]
l-wx------ 1 build build 64 Aug 18 00:55 3 -> /dev/null


> ss -tn
State      Recv-Q Send-Q Local Address:Port               Peer Address:Port              


> ss -tln
State      Recv-Q Send-Q Local Address:Port               Peer Address:Port              


> ps xua | grep osmo
build    15552  5.0  0.0  54232 21456 ?        S    00:55   0:00 /usr/bin/python3 /usr/local/bin/osmotestconfig.py -p /build -w /build -v
build    15575  0.0  0.0 21474986304 34520 ?   R    00:55   0:00 src/osmo-bsc/osmo-bsc -c /build/writtenconfig/osmo-bsc.cfgpoopg9l1
build    15582  0.0  0.0   4280   704 ?        S    00:55   0:00 /bin/sh -c ps xua | grep osmo
build    15584  0.0  0.0  12784   936 ?        S    00:55   0:00 grep osmo

Connecting socket failed, retrying...
Socket: in 2 tries, connected to 127.0.0.1:4242 <socket.socket fd=5, family=AddressFamily.AF_INET, type=SocketKind.SOCK_STREAM, proto=0, laddr=('127.0.0.1', 53328), raddr=('127.0.0.1', 4242)> (1 sockets open)
Terminating took 0.897s
Socket: closing 127.0.0.1:4242 <socket.socket fd=5, family=AddressFamily.AF_INET, type=SocketKind.SOCK_STREAM, proto=0, laddr=('127.0.0.1', 53328), raddr=('127.0.0.1', 4242)> (0 sockets open)
Verifying src/osmo-bsc/osmo-bsc -c /build/doc/examples/osmo-bsc/osmo-bsc_custom-sccp.cfg, test verify_doc
Launching: PWD=/build 'src/osmo-bsc/osmo-bsc' '-c' '/build/doc/examples/osmo-bsc/osmo-bsc_custom-sccp.cfg'

> ls -l /proc/15552/fd
total 0
lr-x------ 1 build build 64 Aug 18 00:55 0 -> pipe:[465469171]
l-wx------ 1 build build 64 Aug 18 00:55 1 -> pipe:[465469172]
l-wx------ 1 build build 64 Aug 18 00:55 2 -> pipe:[465469173]
l-wx------ 1 build build 64 Aug 18 00:55 3 -> /dev/null


> ss -tn
State      Recv-Q Send-Q Local Address:Port               Peer Address:Port              


> ss -tln
State      Recv-Q Send-Q Local Address:Port               Peer Address:Port              


> ps xua | grep osmo
build    15552  3.7  0.0  54232 21456 ?        S    00:55   0:00 /usr/bin/python3 /usr/local/bin/osmotestconfig.py -p /build -w /build -v
build    15586  0.0  0.0 21474986468 35348 ?   R    00:55   0:00 src/osmo-bsc/osmo-bsc -c /build/doc/examples/osmo-bsc/osmo-bsc_custom-sccp.cfg
build    15593  0.0  0.0   4280   700 ?        S    00:55   0:00 /bin/sh -c ps xua | grep osmo
build    15595  0.0  0.0  12784   944 ?        R    00:55   0:00 grep osmo

Connecting socket failed, retrying...
Socket: in 2 tries, connected to 127.0.0.1:4242 <socket.socket fd=5, family=AddressFamily.AF_INET, type=SocketKind.SOCK_STREAM, proto=0, laddr=('127.0.0.1', 53378), raddr=('127.0.0.1', 4242)> (1 sockets open)
Terminating took 0.475s
Socket: closing 127.0.0.1:4242 <socket.socket fd=5, family=AddressFamily.AF_INET, type=SocketKind.SOCK_STREAM, proto=0, laddr=('127.0.0.1', 53378), raddr=('127.0.0.1', 4242)> (0 sockets open)
Verifying src/osmo-bsc/osmo-bsc -c /build/writtenconfig/osmo-bsc_custom-sccp.cfgt037e7m1, test write_config
Launching: PWD=/build 'src/osmo-bsc/osmo-bsc' '-c' '/build/writtenconfig/osmo-bsc_custom-sccp.cfgt037e7m1'

> ls -l /proc/15552/fd
total 0
lr-x------ 1 build build 64 Aug 18 00:55 0 -> pipe:[465469171]
l-wx------ 1 build build 64 Aug 18 00:55 1 -> pipe:[465469172]
l-wx------ 1 build build 64 Aug 18 00:55 2 -> pipe:[465469173]
l-wx------ 1 build build 64 Aug 18 00:55 3 -> /dev/null
Documentation error (missing docs): 
<command id='no mgw reset-endpoint NAME'>
        <param name='NAME' doc='(null)' />



> ss -tn
State      Recv-Q Send-Q Local Address:Port               Peer Address:Port              


> ss -tln
State      Recv-Q Send-Q Local Address:Port               Peer Address:Port              


> ps xua | grep osmo
build    15552  3.6  0.0  54240 21464 ?        S    00:55   0:00 /usr/bin/python3 /usr/local/bin/osmotestconfig.py -p /build -w /build -v
build    15597  0.0  0.0 21474986468 35196 ?   R    00:55   0:00 src/osmo-bsc/osmo-bsc -c /build/writtenconfig/osmo-bsc_custom-sccp.cfgt037e7m1
build    15604  0.0  0.0   4280   712 ?        S    00:55   0:00 /bin/sh -c ps xua | grep osmo
build    15606  0.0  0.0   8868   400 ?        R    00:55   0:00 grep osmo

Socket: in 1 tries, connected to 127.0.0.1:4242 <socket.socket fd=4, family=AddressFamily.AF_INET, type=SocketKind.SOCK_STREAM, proto=0, laddr=('127.0.0.1', 53406), raddr=('127.0.0.1', 4242)> (1 sockets open)
Terminating took 0.475s
Socket: closing 127.0.0.1:4242 <socket.socket fd=4, family=AddressFamily.AF_INET, type=SocketKind.SOCK_STREAM, proto=0, laddr=('127.0.0.1', 53406), raddr=('127.0.0.1', 4242)> (0 sockets open)
Verifying src/osmo-bsc/osmo-bsc -c /build/writtenconfig/osmo-bsc_custom-sccp.cfgt037e7m1, test token_vty_command
Launching: PWD=/build 'src/osmo-bsc/osmo-bsc' '-c' '/build/writtenconfig/osmo-bsc_custom-sccp.cfgt037e7m1'

> ls -l /proc/15552/fd
total 0
lr-x------ 1 build build 64 Aug 18 00:55 0 -> pipe:[465469171]
l-wx------ 1 build build 64 Aug 18 00:55 1 -> pipe:[465469172]
l-wx------ 1 build build 64 Aug 18 00:55 2 -> pipe:[465469173]
l-wx------ 1 build build 64 Aug 18 00:55 3 -> /dev/null


> ss -tn
State      Recv-Q Send-Q Local Address:Port               Peer Address:Port              


> ss -tln
State      Recv-Q Send-Q Local Address:Port               Peer Address:Port              


> ps xua | grep osmo
build    15552  3.0  0.0  54240 21464 ?        S    00:55   0:00 /usr/bin/python3 /usr/local/bin/osmotestconfig.py -p /build -w /build -v
build    15608  0.0  0.0 21474986304 34392 ?   R    00:55   0:00 src/osmo-bsc/osmo-bsc -c /build/writtenconfig/osmo-bsc_custom-sccp.cfgt037e7m1
build    15615  0.0  0.0   4280   700 ?        S    00:55   0:00 /bin/sh -c ps xua | grep osmo
build    15617  0.0  0.0  12784   956 ?        S    00:55   0:00 grep osmo

ERRORS: 2
Connecting socket failed, retrying...
Socket: in 2 tries, connected to 127.0.0.1:4242 <socket.socket fd=5, family=AddressFamily.AF_INET, type=SocketKind.SOCK_STREAM, proto=0, laddr=('127.0.0.1', 53454), raddr=('127.0.0.1', 4242)> (1 sockets open)
Terminating took 0.897s
Socket: closing 127.0.0.1:4242 <socket.socket fd=5, family=AddressFamily.AF_INET, type=SocketKind.SOCK_STREAM, proto=0, laddr=('127.0.0.1', 53454), raddr=('127.0.0.1', 4242)> (0 sockets open)
Makefile:708: recipe for target 'python-tests' failed
make[5]: Leaving directory '/build/tests'
make[5]: *** [python-tests] Error 2
Makefile:730: recipe for target 'check-local' failed
make[4]: *** [check-local] Error 2
make[4]: Leaving directory '/build/tests'
Makefile:568: recipe for target 'check-am' failed
make[3]: *** [check-am] Error 2
make[3]: Leaving directory '/build/tests'
Makefile:420: recipe for target 'check-recursive' failed
make[2]: Leaving directory '/build/tests'
make[2]: *** [check-recursive] Error 1
Makefile:453: recipe for target 'check-recursive' failed
make[1]: Leaving directory '/build'
make[1]: *** [check-recursive] Error 1
make: *** [check] Error 2
Makefile:744: recipe for target 'check' failed
+ cat-testlogs.sh
Build step 'Execute shell' marked build as failure
[WARNINGS]Skipping publisher since build result is FAILURE


More information about the jenkins-notifications mailing list