Build failed in Jenkins: master-osmo-bsc » a1=default,a2=default,a3=default,a4=default,osmocom-master-debian9 #15352

jenkins at lists.osmocom.org jenkins at lists.osmocom.org
Wed Aug 18 00:14:31 UTC 2021


See <https://jenkins.osmocom.org/jenkins/job/master-osmo-bsc/a1=default,a2=default,a3=default,a4=default,label=osmocom-master-debian9/15352/display/redirect>

Changes:


------------------------------------------
[...truncated 850.83 KB...]
build    15547  0.0  0.0  12784   936 ?        R    00:14   0:00 grep osmo

ok
test_unknown_command (__main__.TestVTY) ... Connecting socket failed, retrying...
Socket: in 2 tries, connected to 127.0.0.1:4242 <socket.socket fd=5, family=AddressFamily.AF_INET, type=SocketKind.SOCK_STREAM, proto=0, laddr=('127.0.0.1', 47310), raddr=('127.0.0.1', 4242)> (1 sockets open)
Socket: closing 127.0.0.1:4242 <socket.socket fd=5, family=AddressFamily.AF_INET, type=SocketKind.SOCK_STREAM, proto=0, laddr=('127.0.0.1', 47310), raddr=('127.0.0.1', 4242)> (0 sockets open)
Launch: ./src/osmo-bsc/osmo-bsc -c /build/doc/examples/osmo-bsc/osmo-bsc.cfg from /build
Launching: PWD=/build './src/osmo-bsc/osmo-bsc' '-c' '/build/doc/examples/osmo-bsc/osmo-bsc.cfg'

> ls -l /proc/15526/fd
total 0
lr-x------ 1 build build 64 Aug 18 00:14 0 -> pipe:[463634113]
l-wx------ 1 build build 64 Aug 18 00:14 1 -> pipe:[463634114]
l-wx------ 1 build build 64 Aug 18 00:14 2 -> pipe:[463634115]
l-wx------ 1 build build 64 Aug 18 00:14 3 -> /dev/null


> ss -tn
State      Recv-Q Send-Q Local Address:Port               Peer Address:Port              


> ss -tln
State      Recv-Q Send-Q Local Address:Port               Peer Address:Port              


> ps xua | grep osmo
build    15526 15.0  0.0  53724 20964 ?        S    00:14   0:00 /usr/bin/python3 /usr/local/bin/osmotestvty.py -p /build -w /build -v
build    15549  0.0  0.0 21474986304 33776 ?   R    00:14   0:00 ./src/osmo-bsc/osmo-bsc -c /build/doc/examples/osmo-bsc/osmo-bsc.cfg
build    15556  0.0  0.0   4280   712 ?        S    00:14   0:00 /bin/sh -c ps xua | grep osmo
build    15558  0.0  0.0  12784   924 ?        R    00:14   0:00 grep osmo

Connecting socket failed, retrying...
Socket: in 2 tries, connected to 127.0.0.1:4242 <socket.socket fd=5, family=AddressFamily.AF_INET, type=SocketKind.SOCK_STREAM, proto=0, laddr=('127.0.0.1', 47314), raddr=('127.0.0.1', 4242)> (1 sockets open)
Socket: closing 127.0.0.1:4242 <socket.socket fd=5, family=AddressFamily.AF_INET, type=SocketKind.SOCK_STREAM, proto=0, laddr=('127.0.0.1', 47314), raddr=('127.0.0.1', 4242)> (0 sockets open)
ok

----------------------------------------------------------------------
Ran 3 tests in 0.884s

OK
osmotestconfig.py -p /build -w /build -v
Verifying src/osmo-bsc/osmo-bsc -c /build/doc/examples/osmo-bsc/osmo-bsc.cfg, test verify_doc
Opening /dev/null
Launching: PWD=/build 'src/osmo-bsc/osmo-bsc' '-c' '/build/doc/examples/osmo-bsc/osmo-bsc.cfg'

> ls -l /proc/15560/fd
total 0
lr-x------ 1 build build 64 Aug 18 00:14 0 -> pipe:[463634113]
l-wx------ 1 build build 64 Aug 18 00:14 1 -> pipe:[463634114]
l-wx------ 1 build build 64 Aug 18 00:14 2 -> pipe:[463634115]
l-wx------ 1 build build 64 Aug 18 00:14 3 -> /dev/null


> ss -tn
Warning: doc/examples/osmo-bsc/osmo-bsc-minimal.cfg is not being tested
Warning: doc/examples/osmo-bsc/siemens/osmo-bsc.bs11.cfg is not being tested
Warning: doc/examples/osmo-bsc/ericsson/osmo-bsc.rbs2308.cfg is not being tested
Warning: doc/examples/osmo-bsc/ericsson/osmo-bsc.dug20-rus02-4trx.cfg is not being tested
Warning: doc/examples/osmo-bsc/ericsson/osmo-bsc.dug20-rus02-8trx.cfg is not being tested
Warning: doc/examples/osmo-bsc/ericsson/osmo-bsc.dug20-rus01-4trx.cfg is not being tested
Warning: doc/examples/osmo-bsc/nokia/osmo-bsc.insite.cfg is not being tested
State      Recv-Q Send-Q Local Address:Port               Peer Address:Port              


> ss -tln
State      Recv-Q Send-Q Local Address:Port               Peer Address:Port              


> ps xua | grep osmo
build    15560 16.0  0.0  53776 20924 ?        S    00:14   0:00 /usr/bin/python3 /usr/local/bin/osmotestconfig.py -p /build -w /build -v
build    15561  0.0  0.0 21474986304 33360 ?   R    00:14   0:00 src/osmo-bsc/osmo-bsc -c /build/doc/examples/osmo-bsc/osmo-bsc.cfg
build    15568  0.0  0.0   4280   740 ?        S    00:14   0:00 /bin/sh -c ps xua | grep osmo
build    15570  0.0  0.0  12784   944 ?        S    00:14   0:00 grep osmo

Connecting socket failed, retrying...
Socket: in 2 tries, connected to 127.0.0.1:4242 <socket.socket fd=5, family=AddressFamily.AF_INET, type=SocketKind.SOCK_STREAM, proto=0, laddr=('127.0.0.1', 47318), raddr=('127.0.0.1', 4242)> (1 sockets open)
Terminating took 0.475s
Socket: closing 127.0.0.1:4242 <socket.socket fd=5, family=AddressFamily.AF_INET, type=SocketKind.SOCK_STREAM, proto=0, laddr=('127.0.0.1', 47318), raddr=('127.0.0.1', 4242)> (0 sockets open)
Verifying src/osmo-bsc/osmo-bsc -c /build/writtenconfig/osmo-bsc.cfg7it6bu4j, test write_config
Launching: PWD=/build 'src/osmo-bsc/osmo-bsc' '-c' '/build/writtenconfig/osmo-bsc.cfg7it6bu4j'

> ls -l /proc/15560/fd
total 0
lr-x------ 1 build build 64 Aug 18 00:14 0 -> pipe:[463634113]
l-wx------ 1 build build 64 Aug 18 00:14 1 -> pipe:[463634114]
l-wx------ 1 build build 64 Aug 18 00:14 2 -> pipe:[463634115]
l-wx------ 1 build build 64 Aug 18 00:14 3 -> /dev/null
Documentation error (missing docs): 
<command id='no mgw reset-endpoint NAME'>
        <param name='NAME' doc='(null)' />



> ss -tn
State      Recv-Q Send-Q Local Address:Port               Peer Address:Port              


> ss -tln
State      Recv-Q Send-Q Local Address:Port               Peer Address:Port              


> ps xua | grep osmo
build    15560  9.0  0.0  53748 21052 ?        S    00:14   0:00 /usr/bin/python3 /usr/local/bin/osmotestconfig.py -p /build -w /build -v
build    15572  0.0  0.0 21474986304 30792 ?   R    00:14   0:00 src/osmo-bsc/osmo-bsc -c /build/writtenconfig/osmo-bsc.cfg7it6bu4j
build    15579  0.0  0.0   4280   736 ?        S    00:14   0:00 /bin/sh -c ps xua | grep osmo
build    15581  0.0  0.0  12784  1016 ?        R    00:14   0:00 grep osmo

Connecting socket failed, retrying...
Socket: in 2 tries, connected to 127.0.0.1:4242 <socket.socket fd=5, family=AddressFamily.AF_INET, type=SocketKind.SOCK_STREAM, proto=0, laddr=('127.0.0.1', 47324), raddr=('127.0.0.1', 4242)> (1 sockets open)
Terminating took 0.897s
Socket: closing 127.0.0.1:4242 <socket.socket fd=5, family=AddressFamily.AF_INET, type=SocketKind.SOCK_STREAM, proto=0, laddr=('127.0.0.1', 47324), raddr=('127.0.0.1', 4242)> (0 sockets open)
Verifying src/osmo-bsc/osmo-bsc -c /build/writtenconfig/osmo-bsc.cfg7it6bu4j, test token_vty_command
Launching: PWD=/build 'src/osmo-bsc/osmo-bsc' '-c' '/build/writtenconfig/osmo-bsc.cfg7it6bu4j'

> ls -l /proc/15560/fd
total 0
lr-x------ 1 build build 64 Aug 18 00:14 0 -> pipe:[463634113]
l-wx------ 1 build build 64 Aug 18 00:14 1 -> pipe:[463634114]
l-wx------ 1 build build 64 Aug 18 00:14 2 -> pipe:[463634115]
l-wx------ 1 build build 64 Aug 18 00:14 3 -> /dev/null


> ss -tn
State      Recv-Q Send-Q Local Address:Port               Peer Address:Port              


> ss -tln
State      Recv-Q Send-Q Local Address:Port               Peer Address:Port              


> ps xua | grep osmo
build    15560  4.7  0.0  53748 21052 ?        S    00:14   0:00 /usr/bin/python3 /usr/local/bin/osmotestconfig.py -p /build -w /build -v
build    15583  0.0  0.0 21474986304 32340 ?   R    00:14   0:00 src/osmo-bsc/osmo-bsc -c /build/writtenconfig/osmo-bsc.cfg7it6bu4j
build    15590  0.0  0.0   4280   752 ?        S    00:14   0:00 /bin/sh -c ps xua | grep osmo
build    15592  0.0  0.0  12784   912 ?        R    00:14   0:00 grep osmo

Connecting socket failed, retrying...
Socket: in 2 tries, connected to 127.0.0.1:4242 <socket.socket fd=5, family=AddressFamily.AF_INET, type=SocketKind.SOCK_STREAM, proto=0, laddr=('127.0.0.1', 47328), raddr=('127.0.0.1', 4242)> (1 sockets open)
Terminating took 0.897s
Socket: closing 127.0.0.1:4242 <socket.socket fd=5, family=AddressFamily.AF_INET, type=SocketKind.SOCK_STREAM, proto=0, laddr=('127.0.0.1', 47328), raddr=('127.0.0.1', 4242)> (0 sockets open)
Verifying src/osmo-bsc/osmo-bsc -c /build/doc/examples/osmo-bsc/osmo-bsc_custom-sccp.cfg, test verify_doc
Launching: PWD=/build 'src/osmo-bsc/osmo-bsc' '-c' '/build/doc/examples/osmo-bsc/osmo-bsc_custom-sccp.cfg'

> ls -l /proc/15560/fd
total 0
lr-x------ 1 build build 64 Aug 18 00:14 0 -> pipe:[463634113]
l-wx------ 1 build build 64 Aug 18 00:14 1 -> pipe:[463634114]
l-wx------ 1 build build 64 Aug 18 00:14 2 -> pipe:[463634115]
l-wx------ 1 build build 64 Aug 18 00:14 3 -> /dev/null


> ss -tn
State      Recv-Q Send-Q Local Address:Port               Peer Address:Port              


> ss -tln
State      Recv-Q Send-Q Local Address:Port               Peer Address:Port              


> ps xua | grep osmo
build    15560  3.1  0.0  53748 21052 ?        S    00:14   0:00 /usr/bin/python3 /usr/local/bin/osmotestconfig.py -p /build -w /build -v
build    15594  0.0  0.0 21474988588 36128 ?   S    00:14   0:00 src/osmo-bsc/osmo-bsc -c /build/doc/examples/osmo-bsc/osmo-bsc_custom-sccp.cfg
build    15601  0.0  0.0   4280   712 ?        S    00:14   0:00 /bin/sh -c ps xua | grep osmo
build    15603  0.0  0.0  12784   992 ?        R    00:14   0:00 grep osmo

Socket: in 1 tries, connected to 127.0.0.1:4242 <socket.socket fd=4, family=AddressFamily.AF_INET, type=SocketKind.SOCK_STREAM, proto=0, laddr=('127.0.0.1', 47334), raddr=('127.0.0.1', 4242)> (1 sockets open)
Terminating took 0.897s
Socket: closing 127.0.0.1:4242 <socket.socket fd=4, family=AddressFamily.AF_INET, type=SocketKind.SOCK_STREAM, proto=0, laddr=('127.0.0.1', 47334), raddr=('127.0.0.1', 4242)> (0 sockets open)
Verifying src/osmo-bsc/osmo-bsc -c /build/writtenconfig/osmo-bsc_custom-sccp.cfg98zpts_s, test write_config
Launching: PWD=/build 'src/osmo-bsc/osmo-bsc' '-c' '/build/writtenconfig/osmo-bsc_custom-sccp.cfg98zpts_s'

> ls -l /proc/15560/fd
total 0
lr-x------ 1 build build 64 Aug 18 00:14 0 -> pipe:[463634113]
l-wx------ 1 build build 64 Aug 18 00:14 1 -> pipe:[463634114]
l-wx------ 1 build build 64 Aug 18 00:14 2 -> pipe:[463634115]
l-wx------ 1 build build 64 Aug 18 00:14 3 -> /dev/null
Documentation error (missing docs): 
<command id='no mgw reset-endpoint NAME'>
        <param name='NAME' doc='(null)' />



> ss -tn
State      Recv-Q Send-Q Local Address:Port               Peer Address:Port              


> ss -tln
State      Recv-Q Send-Q Local Address:Port               Peer Address:Port              


> ps xua | grep osmo
build    15560  3.1  0.0  54244 21548 ?        S    00:14   0:00 /usr/bin/python3 /usr/local/bin/osmotestconfig.py -p /build -w /build -v
build    15605  0.0  0.0 21474986468 35056 ?   R    00:14   0:00 src/osmo-bsc/osmo-bsc -c /build/writtenconfig/osmo-bsc_custom-sccp.cfg98zpts_s
build    15612  0.0  0.0   4280   708 ?        S    00:14   0:00 /bin/sh -c ps xua | grep osmo
build    15614  0.0  0.0  12784   940 ?        S    00:14   0:00 grep osmo

Connecting socket failed, retrying...
Socket: in 2 tries, connected to 127.0.0.1:4242 <socket.socket fd=5, family=AddressFamily.AF_INET, type=SocketKind.SOCK_STREAM, proto=0, laddr=('127.0.0.1', 47340), raddr=('127.0.0.1', 4242)> (1 sockets open)
Terminating took 0.168s
Socket: closing 127.0.0.1:4242 <socket.socket fd=5, family=AddressFamily.AF_INET, type=SocketKind.SOCK_STREAM, proto=0, laddr=('127.0.0.1', 47340), raddr=('127.0.0.1', 4242)> (0 sockets open)
Verifying src/osmo-bsc/osmo-bsc -c /build/writtenconfig/osmo-bsc_custom-sccp.cfg98zpts_s, test token_vty_command
Launching: PWD=/build 'src/osmo-bsc/osmo-bsc' '-c' '/build/writtenconfig/osmo-bsc_custom-sccp.cfg98zpts_s'

> ls -l /proc/15560/fd
total 0
lr-x------ 1 build build 64 Aug 18 00:14 0 -> pipe:[463634113]
l-wx------ 1 build build 64 Aug 18 00:14 1 -> pipe:[463634114]
l-wx------ 1 build build 64 Aug 18 00:14 2 -> pipe:[463634115]
l-wx------ 1 build build 64 Aug 18 00:14 3 -> /dev/null


> ss -tn
State      Recv-Q Send-Q Local Address:Port               Peer Address:Port              


> ss -tln
State      Recv-Q Send-Q Local Address:Port               Peer Address:Port              


> ps xua | grep osmo
build    15560  2.8  0.0  54244 21548 ?        S    00:14   0:00 /usr/bin/python3 /usr/local/bin/osmotestconfig.py -p /build -w /build -v
build    15616  0.0  0.0 21474988588 36488 ?   S    00:14   0:00 src/osmo-bsc/osmo-bsc -c /build/writtenconfig/osmo-bsc_custom-sccp.cfg98zpts_s
build    15623  0.0  0.0   4280   756 ?        S    00:14   0:00 /bin/sh -c ps xua | grep osmo
build    15625  0.0  0.0   4280    84 ?        R    00:14   0:00 /bin/sh -c ps xua | grep osmo

Socket: in 1 tries, connected to 127.0.0.1:4242 <socket.socket fd=4, family=AddressFamily.AF_INET, type=SocketKind.SOCK_STREAM, proto=0, laddr=('127.0.0.1', 47342), raddr=('127.0.0.1', 4242)> (1 sockets open)
Socket: closing 127.0.0.1:4242 <socket.socket fd=4, family=AddressFamily.AF_INET, type=SocketKind.SOCK_STREAM, proto=0, laddr=('127.0.0.1', 47342), raddr=('127.0.0.1', 4242)> (0 sockets open)
ERRORS: 2
make[5]: *** [python-tests] Error 2
Makefile:708: recipe for target 'python-tests' failed
make[5]: Leaving directory '/build/tests'
Makefile:730: recipe for target 'check-local' failed
make[4]: *** [check-local] Error 2
make[4]: Leaving directory '/build/tests'
Makefile:568: recipe for target 'check-am' failed
make[3]: *** [check-am] Error 2
make[3]: Leaving directory '/build/tests'
Makefile:420: recipe for target 'check-recursive' failed
make[2]: *** [check-recursive] Error 1
make[2]: Leaving directory '/build/tests'
Makefile:453: recipe for target 'check-recursive' failed
make[1]: *** [check-recursive] Error 1
make[1]: Leaving directory '/build'
Makefile:744: recipe for target 'check' failed
make: *** [check] Error 2
+ cat-testlogs.sh
Build step 'Execute shell' marked build as failure
[WARNINGS]Skipping publisher since build result is FAILURE


More information about the jenkins-notifications mailing list