Build failed in Jenkins: master-osmo-msc » --disable-iu,1,a3=default,a4=default,osmocom-master-debian9 #25991

jenkins at lists.osmocom.org jenkins at lists.osmocom.org
Wed Aug 18 01:00:35 UTC 2021


See <https://jenkins.osmocom.org/jenkins/job/master-osmo-msc/IU=--disable-iu,WITH_MANUALS=1,a3=default,a4=default,label=osmocom-master-debian9/25991/display/redirect>

Changes:


------------------------------------------
[...truncated 431.60 KB...]
  2: sms_queue_test                                  ok
  3: db_sms_test                                     ok
  4: msc_vlr_test_no_authen                          ok
  5: msc_vlr_test_gsm_authen                         ok
  6: msc_vlr_test_gsm_ciph                           ok
  7: msc_vlr_test_umts_authen                        ok
  8: msc_vlr_test_authen_reuse                       ok
  9: msc_vlr_test_hlr_reject                         ok
 10: msc_vlr_test_hlr_timeout                        ok
 11: msc_vlr_test_ms_timeout                         ok
 12: msc_vlr_test_reject_concurrency                 ok
 13: msc_vlr_test_call                               ok
 14: msc_vlr_test_rest                               ok
 15: msc_vlr_test_ss                                 ok
 16: sdp_msg_test                                    ok
 17: mncc_test                                       ok

## ------------- ##
## Test results. ##
## ------------- ##

All 17 tests were successful.
make  python-tests
make[5]: Entering directory '/build/tests'
make vty-test
make[6]: Entering directory '/build/tests'
make vty-python-test
make[7]: Entering directory '/build/tests'
IU=0 osmotestvty.py -p /build -w /build -v
test_history (__main__.TestVTY) ... confpath /build, workdir /build
Running tests for specific VTY commands
Launch: ./src/osmo-msc/osmo-msc -c /build/doc/examples/osmo-msc/osmo-msc.cfg from /build
Opening /dev/null
Launching: PWD=/build './src/osmo-msc/osmo-msc' '-c' '/build/doc/examples/osmo-msc/osmo-msc.cfg'

> ls -l /proc/27948/fd
total 0
lr-x------ 1 build build 64 Aug 18 01:00 0 -> pipe:[466398471]
l-wx------ 1 build build 64 Aug 18 01:00 1 -> pipe:[466398472]
l-wx------ 1 build build 64 Aug 18 01:00 2 -> pipe:[466398473]
l-wx------ 1 build build 64 Aug 18 01:00 3 -> /dev/null


> ss -tn
State      Recv-Q Send-Q Local Address:Port               Peer Address:Port              


> ss -tln
State      Recv-Q Send-Q Local Address:Port               Peer Address:Port              


> ps xua | grep osmo
build    27948 14.0  0.0  53736 20940 ?        S    01:00   0:00 /usr/bin/python3 /usr/local/bin/osmotestvty.py -p /build -w /build -v
build    27949  0.0  0.0 21474983812 22944 ?   R    01:00   0:00 ./src/osmo-msc/osmo-msc -c /build/doc/examples/osmo-msc/osmo-msc.cfg
build    27956  0.0  0.0   4280   748 ?        S    01:00   0:00 /bin/sh -c ps xua | grep osmo
build    27958  0.0  0.0   4280    88 ?        R    01:00   0:00 /bin/sh -c ps xua | grep osmo

ok
test_terminal_length (__main__.TestVTY) ... Socket: in 1 tries, connected to 127.0.0.1:4254 <socket.socket fd=4, family=AddressFamily.AF_INET, type=SocketKind.SOCK_STREAM, proto=0, laddr=('127.0.0.1', 41796), raddr=('127.0.0.1', 4254)> (1 sockets open)
Socket: closing 127.0.0.1:4254 <socket.socket fd=4, family=AddressFamily.AF_INET, type=SocketKind.SOCK_STREAM, proto=0, laddr=('127.0.0.1', 41796), raddr=('127.0.0.1', 4254)> (0 sockets open)
Terminating took 0.897s
Launch: ./src/osmo-msc/osmo-msc -c /build/doc/examples/osmo-msc/osmo-msc.cfg from /build
Launching: PWD=/build './src/osmo-msc/osmo-msc' '-c' '/build/doc/examples/osmo-msc/osmo-msc.cfg'

> ls -l /proc/27948/fd
total 0
lr-x------ 1 build build 64 Aug 18 01:00 0 -> pipe:[466398471]
l-wx------ 1 build build 64 Aug 18 01:00 1 -> pipe:[466398472]
l-wx------ 1 build build 64 Aug 18 01:00 2 -> pipe:[466398473]
l-wx------ 1 build build 64 Aug 18 01:00 3 -> /dev/null


> ss -tn
State      Recv-Q Send-Q Local Address:Port               Peer Address:Port              


> ss -tln
State      Recv-Q Send-Q Local Address:Port               Peer Address:Port              


> ps xua | grep osmo
build    27948  5.0  0.0  53736 21028 ?        S    01:00   0:00 /usr/bin/python3 /usr/local/bin/osmotestvty.py -p /build -w /build -v
build    27960  0.0  0.0 21474989440 26284 ?   D    01:00   0:00 ./src/osmo-msc/osmo-msc -c /build/doc/examples/osmo-msc/osmo-msc.cfg
build    27967  0.0  0.0   4280   716 ?        S    01:00   0:00 /bin/sh -c ps xua | grep osmo
build    27969  0.0  0.0  12784   944 ?        S    01:00   0:00 grep osmo

ok
test_unknown_command (__main__.TestVTY) ... Socket: in 1 tries, connected to 127.0.0.1:4254 <socket.socket fd=4, family=AddressFamily.AF_INET, type=SocketKind.SOCK_STREAM, proto=0, laddr=('127.0.0.1', 41798), raddr=('127.0.0.1', 4254)> (1 sockets open)
Socket: closing 127.0.0.1:4254 <socket.socket fd=4, family=AddressFamily.AF_INET, type=SocketKind.SOCK_STREAM, proto=0, laddr=('127.0.0.1', 41798), raddr=('127.0.0.1', 4254)> (0 sockets open)
Terminating took 1.415s
Launch: ./src/osmo-msc/osmo-msc -c /build/doc/examples/osmo-msc/osmo-msc.cfg from /build
Launching: PWD=/build './src/osmo-msc/osmo-msc' '-c' '/build/doc/examples/osmo-msc/osmo-msc.cfg'

> ls -l /proc/27948/fd
total 0
lr-x------ 1 build build 64 Aug 18 01:00 0 -> pipe:[466398471]
l-wx------ 1 build build 64 Aug 18 01:00 1 -> pipe:[466398472]
l-wx------ 1 build build 64 Aug 18 01:00 2 -> pipe:[466398473]
l-wx------ 1 build build 64 Aug 18 01:00 3 -> /dev/null


> ss -tn
State      Recv-Q Send-Q Local Address:Port               Peer Address:Port              


> ss -tln
State      Recv-Q Send-Q Local Address:Port               Peer Address:Port              
LISTEN     0      10           *:2775                     *:*                  
LISTEN     0      10     127.0.0.1:4254                     *:*                  
LISTEN     0      10     127.0.0.1:4255                     *:*                  


> ps xua | grep osmo
build    27948  3.2  0.0  53736 21028 ?        S    01:00   0:00 /usr/bin/python3 /usr/local/bin/osmotestvty.py -p /build -w /build -v
build    27971  0.0  0.0 21474989440 26320 ?   D    01:00   0:00 ./src/osmo-msc/osmo-msc -c /build/doc/examples/osmo-msc/osmo-msc.cfg
build    27978  0.0  0.0   4280   724 ?        S    01:00   0:00 /bin/sh -c ps xua | grep osmo
build    27980  0.0  0.0   4280    88 ?        R    01:00   0:00 /bin/sh -c ps xua | grep osmo

ok

----------------------------------------------------------------------
Ran 3 tests in 5.689s

OK
Socket: in 1 tries, connected to 127.0.0.1:4254 <socket.socket fd=4, family=AddressFamily.AF_INET, type=SocketKind.SOCK_STREAM, proto=0, laddr=('127.0.0.1', 41800), raddr=('127.0.0.1', 4254)> (1 sockets open)
Socket: closing 127.0.0.1:4254 <socket.socket fd=4, family=AddressFamily.AF_INET, type=SocketKind.SOCK_STREAM, proto=0, laddr=('127.0.0.1', 41800), raddr=('127.0.0.1', 4254)> (0 sockets open)
Terminating took 0.897s
IU=0 osmotestconfig.py -p /build -w /build -v
Verifying src/osmo-msc/osmo-msc -c /build/doc/examples/osmo-msc/osmo-msc.cfg, test verify_doc
Opening /dev/null
Launching: PWD=/build 'src/osmo-msc/osmo-msc' '-c' '/build/doc/examples/osmo-msc/osmo-msc.cfg'

> ls -l /proc/27982/fd
total 0
lr-x------ 1 build build 64 Aug 18 01:00 0 -> pipe:[466398471]
l-wx------ 1 build build 64 Aug 18 01:00 1 -> pipe:[466398472]
l-wx------ 1 build build 64 Aug 18 01:00 2 -> pipe:[466398473]
l-wx------ 1 build build 64 Aug 18 01:00 3 -> /dev/null
Warning: doc/examples/osmo-msc/osmo-msc_custom-sccp.cfg is not being tested
Warning: doc/examples/osmo-msc/osmo-msc_multi-cs7.cfg is not being tested


> ss -tn
State      Recv-Q Send-Q Local Address:Port               Peer Address:Port              


> ss -tln
State      Recv-Q Send-Q Local Address:Port               Peer Address:Port              


> ps xua | grep osmo
build    27982  0.0  0.0  53708 20800 ?        S    01:00   0:00 /usr/bin/python3 /usr/local/bin/osmotestconfig.py -p /build -w /build -v
build    27983  0.0  0.0 21474989064 24676 ?   R    01:00   0:00 src/osmo-msc/osmo-msc -c /build/doc/examples/osmo-msc/osmo-msc.cfg
build    27990  0.0  0.0   4280   748 ?        S    01:00   0:00 /bin/sh -c ps xua | grep osmo
build    27992  0.0  0.0  12784   932 ?        S    01:00   0:00 grep osmo

Socket: in 1 tries, connected to 127.0.0.1:4254 <socket.socket fd=4, family=AddressFamily.AF_INET, type=SocketKind.SOCK_STREAM, proto=0, laddr=('127.0.0.1', 41804), raddr=('127.0.0.1', 4254)> (1 sockets open)
Terminating took 0.897s
Socket: closing 127.0.0.1:4254 <socket.socket fd=4, family=AddressFamily.AF_INET, type=SocketKind.SOCK_STREAM, proto=0, laddr=('127.0.0.1', 41804), raddr=('127.0.0.1', 4254)> (0 sockets open)
Verifying src/osmo-msc/osmo-msc -c /build/writtenconfig/osmo-msc.cfg4fxhq0pj, test write_config
Launching: PWD=/build 'src/osmo-msc/osmo-msc' '-c' '/build/writtenconfig/osmo-msc.cfg4fxhq0pj'

> ls -l /proc/27982/fd
total 0
lr-x------ 1 build build 64 Aug 18 01:00 0 -> pipe:[466398471]
l-wx------ 1 build build 64 Aug 18 01:00 1 -> pipe:[466398472]
l-wx------ 1 build build 64 Aug 18 01:00 2 -> pipe:[466398473]
l-wx------ 1 build build 64 Aug 18 01:00 3 -> /dev/null
Documentation error (missing docs): 
<command id='no mgw reset-endpoint NAME'>
        <param name='NAME' doc='(null)' />



> ss -tn
State      Recv-Q Send-Q Local Address:Port               Peer Address:Port              


> ss -tln
State      Recv-Q Send-Q Local Address:Port               Peer Address:Port              


> ps xua | grep osmo
build    27982  8.0  0.0  54184 21328 ?        S    01:00   0:00 /usr/bin/python3 /usr/local/bin/osmotestconfig.py -p /build -w /build -v
build    27994  0.0  0.0 21474989004 25688 ?   R    01:00   0:00 src/osmo-msc/osmo-msc -c /build/writtenconfig/osmo-msc.cfg4fxhq0pj
build    28001  0.0  0.0   4280   752 ?        S    01:00   0:00 /bin/sh -c ps xua | grep osmo
build    28003  0.0  0.0  12784   944 ?        S    01:00   0:00 grep osmo

Socket: in 1 tries, connected to 127.0.0.1:4254 <socket.socket fd=4, family=AddressFamily.AF_INET, type=SocketKind.SOCK_STREAM, proto=0, laddr=('127.0.0.1', 41810), raddr=('127.0.0.1', 4254)> (1 sockets open)
Terminating took 0.168s
Socket: closing 127.0.0.1:4254 <socket.socket fd=4, family=AddressFamily.AF_INET, type=SocketKind.SOCK_STREAM, proto=0, laddr=('127.0.0.1', 41810), raddr=('127.0.0.1', 4254)> (0 sockets open)
Verifying src/osmo-msc/osmo-msc -c /build/writtenconfig/osmo-msc.cfg4fxhq0pj, test token_vty_command
Launching: PWD=/build 'src/osmo-msc/osmo-msc' '-c' '/build/writtenconfig/osmo-msc.cfg4fxhq0pj'

> ls -l /proc/27982/fd
total 0
lr-x------ 1 build build 64 Aug 18 01:00 0 -> pipe:[466398471]
l-wx------ 1 build build 64 Aug 18 01:00 1 -> pipe:[466398472]
l-wx------ 1 build build 64 Aug 18 01:00 2 -> pipe:[466398473]
l-wx------ 1 build build 64 Aug 18 01:00 3 -> /dev/null


> ss -tn
State      Recv-Q Send-Q Local Address:Port               Peer Address:Port              


> ss -tln
State      Recv-Q Send-Q Local Address:Port               Peer Address:Port              
LISTEN     0      10           *:2775                     *:*                  
LISTEN     0      10     127.0.0.1:4254                     *:*                  
LISTEN     0      10     127.0.0.1:4255                     *:*                  


> ps xua | grep osmo
build    27982  5.3  0.0  54184 21328 ?        S    01:00   0:00 /usr/bin/python3 /usr/local/bin/osmotestconfig.py -p /build -w /build -v
build    28005  0.0  0.0 21474989440 26512 ?   D    01:00   0:00 src/osmo-msc/osmo-msc -c /build/writtenconfig/osmo-msc.cfg4fxhq0pj
build    28012  0.0  0.0   4280   708 ?        S    01:00   0:00 /bin/sh -c ps xua | grep osmo
build    28014  0.0  0.0  12784  1016 ?        S    01:00   0:00 grep osmo

ERRORS: 1
Socket: in 1 tries, connected to 127.0.0.1:4254 <socket.socket fd=4, family=AddressFamily.AF_INET, type=SocketKind.SOCK_STREAM, proto=0, laddr=('127.0.0.1', 41812), raddr=('127.0.0.1', 4254)> (1 sockets open)
Terminating took 0.897s
Socket: closing 127.0.0.1:4254 <socket.socket fd=4, family=AddressFamily.AF_INET, type=SocketKind.SOCK_STREAM, proto=0, laddr=('127.0.0.1', 41812), raddr=('127.0.0.1', 4254)> (0 sockets open)
Makefile:720: recipe for target 'vty-python-test' failed
make[7]: Leaving directory '/build/tests'
make[7]: *** [vty-python-test] Error 1
Makefile:740: recipe for target 'vty-test' failed
make[6]: Leaving directory '/build/tests'
make[6]: *** [vty-test] Error 2
Makefile:710: recipe for target 'python-tests' failed
make[5]: *** [python-tests] Error 2
make[5]: Leaving directory '/build/tests'
Makefile:763: recipe for target 'check-local' failed
make[4]: *** [check-local] Error 2
make[4]: Leaving directory '/build/tests'
make[3]: *** [check-am] Error 2
Makefile:569: recipe for target 'check-am' failed
make[3]: Leaving directory '/build/tests'
Makefile:421: recipe for target 'check-recursive' failed
make[2]: Leaving directory '/build/tests'
make[2]: *** [check-recursive] Error 1
Makefile:469: recipe for target 'check-recursive' failed
make[1]: Leaving directory '/build'
make[1]: *** [check-recursive] Error 1
make: *** [check] Error 2
Makefile:760: recipe for target 'check' failed
+ cat-testlogs.sh
Build step 'Execute shell' marked build as failure
[WARNINGS]Skipping publisher since build result is FAILURE


More information about the jenkins-notifications mailing list