Build failed in Jenkins: master-osmo-msc » --disable-iu,1,a3=default,a4=default,osmocom-master-debian9 #25990

jenkins at lists.osmocom.org jenkins at lists.osmocom.org
Wed Aug 18 00:59:10 UTC 2021


See <https://jenkins.osmocom.org/jenkins/job/master-osmo-msc/IU=--disable-iu,WITH_MANUALS=1,a3=default,a4=default,label=osmocom-master-debian9/25990/display/redirect>

Changes:


------------------------------------------
[...truncated 430.79 KB...]
## osmo-msc 1.7.0.20-945b0 test suite. ##
## ----------------------------------- ##

Regression tests.

  1: smpp                                            ok
  2: sms_queue_test                                  ok
  3: db_sms_test                                     ok
  4: msc_vlr_test_no_authen                          ok
  5: msc_vlr_test_gsm_authen                         ok
  6: msc_vlr_test_gsm_ciph                           ok
  7: msc_vlr_test_umts_authen                        ok
  8: msc_vlr_test_authen_reuse                       ok
  9: msc_vlr_test_hlr_reject                         ok
 10: msc_vlr_test_hlr_timeout                        ok
 11: msc_vlr_test_ms_timeout                         ok
 12: msc_vlr_test_reject_concurrency                 ok
 13: msc_vlr_test_call                               ok
 14: msc_vlr_test_rest                               ok
 15: msc_vlr_test_ss                                 ok
 16: sdp_msg_test                                    ok
 17: mncc_test                                       ok

## ------------- ##
## Test results. ##
## ------------- ##

All 17 tests were successful.
make  python-tests
make[5]: Entering directory '/build/tests'
make vty-test
make[6]: Entering directory '/build/tests'
make vty-python-test
make[7]: Entering directory '/build/tests'
IU=0 osmotestvty.py -p /build -w /build -v
test_history (__main__.TestVTY) ... confpath /build, workdir /build
Running tests for specific VTY commands
Launch: ./src/osmo-msc/osmo-msc -c /build/doc/examples/osmo-msc/osmo-msc.cfg from /build
Opening /dev/null
Launching: PWD=/build './src/osmo-msc/osmo-msc' '-c' '/build/doc/examples/osmo-msc/osmo-msc.cfg'

> ls -l /proc/27935/fd
total 0
lr-x------ 1 build build 64 Aug 18 00:59 0 -> pipe:[1604307056]
l-wx------ 1 build build 64 Aug 18 00:59 1 -> pipe:[1604307057]
l-wx------ 1 build build 64 Aug 18 00:59 2 -> pipe:[1604307058]
l-wx------ 1 build build 64 Aug 18 00:59 3 -> /dev/null


> ss -tn
State      Recv-Q Send-Q Local Address:Port               Peer Address:Port              


> ss -tln
State      Recv-Q Send-Q Local Address:Port               Peer Address:Port              


> ps xua | grep osmo
build    27935  0.0  0.0  53724 20828 ?        S    00:59   0:00 /usr/bin/python3 /usr/local/bin/osmotestvty.py -p /build -w /build -v
build    27936  0.0  0.0 21474989064 34892 ?   R    00:59   0:00 ./src/osmo-msc/osmo-msc -c /build/doc/examples/osmo-msc/osmo-msc.cfg
build    27943  0.0  0.0   4280   744 ?        S    00:59   0:00 /bin/sh -c ps xua | grep osmo
build    27945  0.0  0.0  12784   940 ?        S    00:59   0:00 grep osmo

ok
test_terminal_length (__main__.TestVTY) ... Socket: in 1 tries, connected to 127.0.0.1:4254 <socket.socket fd=4, family=AddressFamily.AF_INET, type=SocketKind.SOCK_STREAM, proto=0, laddr=('127.0.0.1', 51694), raddr=('127.0.0.1', 4254)> (1 sockets open)
Socket: closing 127.0.0.1:4254 <socket.socket fd=4, family=AddressFamily.AF_INET, type=SocketKind.SOCK_STREAM, proto=0, laddr=('127.0.0.1', 51694), raddr=('127.0.0.1', 4254)> (0 sockets open)
Terminating took 0.897s
Launch: ./src/osmo-msc/osmo-msc -c /build/doc/examples/osmo-msc/osmo-msc.cfg from /build
Launching: PWD=/build './src/osmo-msc/osmo-msc' '-c' '/build/doc/examples/osmo-msc/osmo-msc.cfg'

> ls -l /proc/27935/fd
total 0
lr-x------ 1 build build 64 Aug 18 00:59 0 -> pipe:[1604307056]
l-wx------ 1 build build 64 Aug 18 00:59 1 -> pipe:[1604307057]
l-wx------ 1 build build 64 Aug 18 00:59 2 -> pipe:[1604307058]
l-wx------ 1 build build 64 Aug 18 00:59 3 -> /dev/null


> ss -tn
State      Recv-Q Send-Q Local Address:Port               Peer Address:Port              


> ss -tln
State      Recv-Q Send-Q Local Address:Port               Peer Address:Port              


> ps xua | grep osmo
build    27935  5.5  0.0  53724 20916 ?        S    00:59   0:00 /usr/bin/python3 /usr/local/bin/osmotestvty.py -p /build -w /build -v
build    27947  0.0  0.0 21474989440 37836 ?   D    00:59   0:00 ./src/osmo-msc/osmo-msc -c /build/doc/examples/osmo-msc/osmo-msc.cfg
build    27954  0.0  0.0   4280   748 ?        S    00:59   0:00 /bin/sh -c ps xua | grep osmo
build    27956  0.0  0.0  12784   912 ?        S    00:59   0:00 grep osmo

ok
test_unknown_command (__main__.TestVTY) ... Socket: in 1 tries, connected to 127.0.0.1:4254 <socket.socket fd=4, family=AddressFamily.AF_INET, type=SocketKind.SOCK_STREAM, proto=0, laddr=('127.0.0.1', 51722), raddr=('127.0.0.1', 4254)> (1 sockets open)
Socket: closing 127.0.0.1:4254 <socket.socket fd=4, family=AddressFamily.AF_INET, type=SocketKind.SOCK_STREAM, proto=0, laddr=('127.0.0.1', 51722), raddr=('127.0.0.1', 4254)> (0 sockets open)
Terminating took 0.897s
Launch: ./src/osmo-msc/osmo-msc -c /build/doc/examples/osmo-msc/osmo-msc.cfg from /build
Launching: PWD=/build './src/osmo-msc/osmo-msc' '-c' '/build/doc/examples/osmo-msc/osmo-msc.cfg'

> ls -l /proc/27935/fd
total 0
lr-x------ 1 build build 64 Aug 18 00:59 0 -> pipe:[1604307056]
l-wx------ 1 build build 64 Aug 18 00:59 1 -> pipe:[1604307057]
l-wx------ 1 build build 64 Aug 18 00:59 2 -> pipe:[1604307058]
l-wx------ 1 build build 64 Aug 18 00:59 3 -> /dev/null


> ss -tn
State      Recv-Q Send-Q Local Address:Port               Peer Address:Port              


> ss -tln
State      Recv-Q Send-Q Local Address:Port               Peer Address:Port              


> ps xua | grep osmo
build    27935  4.0  0.0  53724 20916 ?        S    00:59   0:00 /usr/bin/python3 /usr/local/bin/osmotestvty.py -p /build -w /build -v
build    27958  0.0  0.0 21474989440 37012 ?   D    00:59   0:00 ./src/osmo-msc/osmo-msc -c /build/doc/examples/osmo-msc/osmo-msc.cfg
build    27965  0.0  0.0   4280   748 ?        S    00:59   0:00 /bin/sh -c ps xua | grep osmo
build    27967  0.0  0.0  12784   932 ?        S    00:59   0:00 grep osmo

ok

----------------------------------------------------------------------
Ran 3 tests in 4.398s

OK
Socket: in 1 tries, connected to 127.0.0.1:4254 <socket.socket fd=4, family=AddressFamily.AF_INET, type=SocketKind.SOCK_STREAM, proto=0, laddr=('127.0.0.1', 51738), raddr=('127.0.0.1', 4254)> (1 sockets open)
Socket: closing 127.0.0.1:4254 <socket.socket fd=4, family=AddressFamily.AF_INET, type=SocketKind.SOCK_STREAM, proto=0, laddr=('127.0.0.1', 51738), raddr=('127.0.0.1', 4254)> (0 sockets open)
Terminating took 0.897s
IU=0 osmotestconfig.py -p /build -w /build -v
Verifying src/osmo-msc/osmo-msc -c /build/doc/examples/osmo-msc/osmo-msc.cfg, test verify_doc
Opening /dev/null
Launching: PWD=/build 'src/osmo-msc/osmo-msc' '-c' '/build/doc/examples/osmo-msc/osmo-msc.cfg'

> ls -l /proc/27969/fd
total 0
lr-x------ 1 build build 64 Aug 18 00:59 0 -> pipe:[1604307056]
l-wx------ 1 build build 64 Aug 18 00:59 1 -> pipe:[1604307057]
l-wx------ 1 build build 64 Aug 18 00:59 2 -> pipe:[1604307058]
l-wx------ 1 build build 64 Aug 18 00:59 3 -> /dev/null


> ss -tn
Warning: doc/examples/osmo-msc/osmo-msc_multi-cs7.cfg is not being tested
Warning: doc/examples/osmo-msc/osmo-msc_custom-sccp.cfg is not being tested
State      Recv-Q Send-Q Local Address:Port               Peer Address:Port              


> ss -tln
State      Recv-Q Send-Q Local Address:Port               Peer Address:Port              


> ps xua | grep osmo
build    27969  0.0  0.0  53776 20872 ?        S    00:59   0:00 /usr/bin/python3 /usr/local/bin/osmotestconfig.py -p /build -w /build -v
build    27970  0.0  0.0 21474989440 36908 ?   R    00:59   0:00 src/osmo-msc/osmo-msc -c /build/doc/examples/osmo-msc/osmo-msc.cfg
build    27977  0.0  0.0   4280   712 ?        S    00:59   0:00 /bin/sh -c ps xua | grep osmo
build    27979  0.0  0.0  12784   928 ?        S    00:59   0:00 grep osmo

Socket: in 1 tries, connected to 127.0.0.1:4254 <socket.socket fd=4, family=AddressFamily.AF_INET, type=SocketKind.SOCK_STREAM, proto=0, laddr=('127.0.0.1', 51764), raddr=('127.0.0.1', 4254)> (1 sockets open)
Terminating took 0.897s
Socket: closing 127.0.0.1:4254 <socket.socket fd=4, family=AddressFamily.AF_INET, type=SocketKind.SOCK_STREAM, proto=0, laddr=('127.0.0.1', 51764), raddr=('127.0.0.1', 4254)> (0 sockets open)
Verifying src/osmo-msc/osmo-msc -c /build/writtenconfig/osmo-msc.cfgdpfwxn39, test write_config
Launching: PWD=/build 'src/osmo-msc/osmo-msc' '-c' '/build/writtenconfig/osmo-msc.cfgdpfwxn39'

> ls -l /proc/27969/fd
total 0
lr-x------ 1 build build 64 Aug 18 00:59 0 -> pipe:[1604307056]
l-wx------ 1 build build 64 Aug 18 00:59 1 -> pipe:[1604307057]
l-wx------ 1 build build 64 Aug 18 00:59 2 -> pipe:[1604307058]
l-wx------ 1 build build 64 Aug 18 00:59 3 -> /dev/null


> ss -tn
Documentation error (missing docs): 
<command id='no mgw reset-endpoint NAME'>
        <param name='NAME' doc='(null)' />

State      Recv-Q Send-Q Local Address:Port               Peer Address:Port              


> ss -tln
State      Recv-Q Send-Q Local Address:Port               Peer Address:Port              


> ps xua | grep osmo
build    27969 11.0  0.0  54224 21396 ?        S    00:59   0:00 /usr/bin/python3 /usr/local/bin/osmotestconfig.py -p /build -w /build -v
build    27981  0.0  0.0 21474989440 37840 ?   D    00:59   0:00 src/osmo-msc/osmo-msc -c /build/writtenconfig/osmo-msc.cfgdpfwxn39
build    27988  0.0  0.0   4280   724 ?        S    00:59   0:00 /bin/sh -c ps xua | grep osmo
build    27990  0.0  0.0  12784   964 ?        S    00:59   0:00 grep osmo

Socket: in 1 tries, connected to 127.0.0.1:4254 <socket.socket fd=4, family=AddressFamily.AF_INET, type=SocketKind.SOCK_STREAM, proto=0, laddr=('127.0.0.1', 51780), raddr=('127.0.0.1', 4254)> (1 sockets open)
Terminating took 0.897s
Socket: closing 127.0.0.1:4254 <socket.socket fd=4, family=AddressFamily.AF_INET, type=SocketKind.SOCK_STREAM, proto=0, laddr=('127.0.0.1', 51780), raddr=('127.0.0.1', 4254)> (0 sockets open)
Verifying src/osmo-msc/osmo-msc -c /build/writtenconfig/osmo-msc.cfgdpfwxn39, test token_vty_command
Launching: PWD=/build 'src/osmo-msc/osmo-msc' '-c' '/build/writtenconfig/osmo-msc.cfgdpfwxn39'

> ls -l /proc/27969/fd
total 0
lr-x------ 1 build build 64 Aug 18 00:59 0 -> pipe:[1604307056]
l-wx------ 1 build build 64 Aug 18 00:59 1 -> pipe:[1604307057]
l-wx------ 1 build build 64 Aug 18 00:59 2 -> pipe:[1604307058]
l-wx------ 1 build build 64 Aug 18 00:59 3 -> /dev/null


> ss -tn
State      Recv-Q Send-Q Local Address:Port               Peer Address:Port              


> ss -tln
State      Recv-Q Send-Q Local Address:Port               Peer Address:Port              


> ps xua | grep osmo
build    27969  4.0  0.0  54224 21396 ?        S    00:59   0:00 /usr/bin/python3 /usr/local/bin/osmotestconfig.py -p /build -w /build -v
build    27992  0.0  0.0 21474989440 37220 ?   D    00:59   0:00 src/osmo-msc/osmo-msc -c /build/writtenconfig/osmo-msc.cfgdpfwxn39
build    27999  0.0  0.0   4280   796 ?        S    00:59   0:00 /bin/sh -c ps xua | grep osmo
build    28001  0.0  0.0  12784   932 ?        S    00:59   0:00 grep osmo

ERRORS: 1
Socket: in 1 tries, connected to 127.0.0.1:4254 <socket.socket fd=4, family=AddressFamily.AF_INET, type=SocketKind.SOCK_STREAM, proto=0, laddr=('127.0.0.1', 51794), raddr=('127.0.0.1', 4254)> (1 sockets open)
Terminating took 0.897s
Socket: closing 127.0.0.1:4254 <socket.socket fd=4, family=AddressFamily.AF_INET, type=SocketKind.SOCK_STREAM, proto=0, laddr=('127.0.0.1', 51794), raddr=('127.0.0.1', 4254)> (0 sockets open)
Makefile:720: recipe for target 'vty-python-test' failed
make[7]: Leaving directory '/build/tests'
make[7]: *** [vty-python-test] Error 1
Makefile:740: recipe for target 'vty-test' failed
make[6]: Leaving directory '/build/tests'
make[6]: *** [vty-test] Error 2
make[5]: *** [python-tests] Error 2
Makefile:710: recipe for target 'python-tests' failed
make[5]: Leaving directory '/build/tests'
Makefile:763: recipe for target 'check-local' failed
make[4]: Leaving directory '/build/tests'
make[4]: *** [check-local] Error 2
make[3]: *** [check-am] Error 2
Makefile:569: recipe for target 'check-am' failed
make[3]: Leaving directory '/build/tests'
Makefile:421: recipe for target 'check-recursive' failed
make[2]: Leaving directory '/build/tests'
make[2]: *** [check-recursive] Error 1
make[1]: *** [check-recursive] Error 1
Makefile:469: recipe for target 'check-recursive' failed
make[1]: Leaving directory '/build'
make: *** [check] Error 2
Makefile:760: recipe for target 'check' failed
+ cat-testlogs.sh
Build step 'Execute shell' marked build as failure
[WARNINGS]Skipping publisher since build result is FAILURE


More information about the jenkins-notifications mailing list