Build failed in Jenkins: master-osmo-msc » --disable-iu,1,a3=default,a4=default,osmocom-master-debian9 #25989

jenkins at lists.osmocom.org jenkins at lists.osmocom.org
Wed Aug 18 00:58:01 UTC 2021


See <https://jenkins.osmocom.org/jenkins/job/master-osmo-msc/IU=--disable-iu,WITH_MANUALS=1,a3=default,a4=default,label=osmocom-master-debian9/25989/display/redirect>

Changes:


------------------------------------------
[...truncated 430.46 KB...]

  1: smpp                                            ok
  2: sms_queue_test                                  ok
  3: db_sms_test                                     ok
  4: msc_vlr_test_no_authen                          ok
  5: msc_vlr_test_gsm_authen                         ok
  6: msc_vlr_test_gsm_ciph                           ok
  7: msc_vlr_test_umts_authen                        ok
  8: msc_vlr_test_authen_reuse                       ok
  9: msc_vlr_test_hlr_reject                         ok
 10: msc_vlr_test_hlr_timeout                        ok
 11: msc_vlr_test_ms_timeout                         ok
 12: msc_vlr_test_reject_concurrency                 ok
 13: msc_vlr_test_call                               ok
 14: msc_vlr_test_rest                               ok
 15: msc_vlr_test_ss                                 ok
 16: sdp_msg_test                                    ok
 17: mncc_test                                       ok

## ------------- ##
## Test results. ##
## ------------- ##

All 17 tests were successful.
make  python-tests
make[5]: Entering directory '/build/tests'
make vty-test
make[6]: Entering directory '/build/tests'
make vty-python-test
make[7]: Entering directory '/build/tests'
IU=0 osmotestvty.py -p /build -w /build -v
test_history (__main__.TestVTY) ... confpath /build, workdir /build
Running tests for specific VTY commands
Launch: ./src/osmo-msc/osmo-msc -c /build/doc/examples/osmo-msc/osmo-msc.cfg from /build
Opening /dev/null
Launching: PWD=/build './src/osmo-msc/osmo-msc' '-c' '/build/doc/examples/osmo-msc/osmo-msc.cfg'

> ls -l /proc/27488/fd
total 0
lr-x------ 1 build build 64 Aug 18 00:57 0 -> pipe:[466058872]
l-wx------ 1 build build 64 Aug 18 00:57 1 -> pipe:[466058873]
l-wx------ 1 build build 64 Aug 18 00:57 2 -> pipe:[466058874]
l-wx------ 1 build build 64 Aug 18 00:57 3 -> /dev/null


> ss -tn
State      Recv-Q Send-Q Local Address:Port               Peer Address:Port              


> ss -tln
State      Recv-Q Send-Q Local Address:Port               Peer Address:Port              
LISTEN     0      10     127.0.0.1:4255                     *:*                  
LISTEN     0      10           *:2775                     *:*                  
LISTEN     0      10     127.0.0.1:4254                     *:*                  


> ps xua | grep osmo
build    27488  0.0  0.0  53724 20908 ?        S    00:57   0:00 /usr/bin/python3 /usr/local/bin/osmotestvty.py -p /build -w /build -v
build    27489  0.0  0.0 21474989440 26144 ?   D    00:57   0:00 ./src/osmo-msc/osmo-msc -c /build/doc/examples/osmo-msc/osmo-msc.cfg
build    27496  0.0  0.0   4280   708 ?        S    00:57   0:00 /bin/sh -c ps xua | grep osmo
build    27498  0.0  0.0  12784   972 ?        S    00:57   0:00 grep osmo

ok
test_terminal_length (__main__.TestVTY) ... Socket: in 1 tries, connected to 127.0.0.1:4254 <socket.socket fd=4, family=AddressFamily.AF_INET, type=SocketKind.SOCK_STREAM, proto=0, laddr=('127.0.0.1', 41450), raddr=('127.0.0.1', 4254)> (1 sockets open)
Socket: closing 127.0.0.1:4254 <socket.socket fd=4, family=AddressFamily.AF_INET, type=SocketKind.SOCK_STREAM, proto=0, laddr=('127.0.0.1', 41450), raddr=('127.0.0.1', 4254)> (0 sockets open)
Terminating took 0.897s
Launch: ./src/osmo-msc/osmo-msc -c /build/doc/examples/osmo-msc/osmo-msc.cfg from /build
Launching: PWD=/build './src/osmo-msc/osmo-msc' '-c' '/build/doc/examples/osmo-msc/osmo-msc.cfg'

> ls -l /proc/27488/fd
total 0
lr-x------ 1 build build 64 Aug 18 00:57 0 -> pipe:[466058872]
l-wx------ 1 build build 64 Aug 18 00:57 1 -> pipe:[466058873]
l-wx------ 1 build build 64 Aug 18 00:57 2 -> pipe:[466058874]
l-wx------ 1 build build 64 Aug 18 00:57 3 -> /dev/null


> ss -tn
State      Recv-Q Send-Q Local Address:Port               Peer Address:Port              


> ss -tln
State      Recv-Q Send-Q Local Address:Port               Peer Address:Port              


> ps xua | grep osmo
build    27488  7.0  0.0  53724 20996 ?        S    00:57   0:00 /usr/bin/python3 /usr/local/bin/osmotestvty.py -p /build -w /build -v
build    27500  0.0  0.0 21474989440 26216 ?   D    00:57   0:00 ./src/osmo-msc/osmo-msc -c /build/doc/examples/osmo-msc/osmo-msc.cfg
build    27507  0.0  0.0   4280   760 ?        S    00:57   0:00 /bin/sh -c ps xua | grep osmo
build    27509  0.0  0.0  12784  1024 ?        S    00:57   0:00 grep osmo

ok
test_unknown_command (__main__.TestVTY) ... Socket: in 1 tries, connected to 127.0.0.1:4254 <socket.socket fd=4, family=AddressFamily.AF_INET, type=SocketKind.SOCK_STREAM, proto=0, laddr=('127.0.0.1', 41468), raddr=('127.0.0.1', 4254)> (1 sockets open)
Socket: closing 127.0.0.1:4254 <socket.socket fd=4, family=AddressFamily.AF_INET, type=SocketKind.SOCK_STREAM, proto=0, laddr=('127.0.0.1', 41468), raddr=('127.0.0.1', 4254)> (0 sockets open)
Terminating took 0.897s
Launch: ./src/osmo-msc/osmo-msc -c /build/doc/examples/osmo-msc/osmo-msc.cfg from /build
Launching: PWD=/build './src/osmo-msc/osmo-msc' '-c' '/build/doc/examples/osmo-msc/osmo-msc.cfg'

> ls -l /proc/27488/fd
total 0
lr-x------ 1 build build 64 Aug 18 00:57 0 -> pipe:[466058872]
l-wx------ 1 build build 64 Aug 18 00:57 1 -> pipe:[466058873]
l-wx------ 1 build build 64 Aug 18 00:57 2 -> pipe:[466058874]
l-wx------ 1 build build 64 Aug 18 00:57 3 -> /dev/null


> ss -tn
State      Recv-Q Send-Q Local Address:Port               Peer Address:Port              


> ss -tln
State      Recv-Q Send-Q Local Address:Port               Peer Address:Port              


> ps xua | grep osmo
build    27488  4.6  0.0  53724 20996 ?        S    00:57   0:00 /usr/bin/python3 /usr/local/bin/osmotestvty.py -p /build -w /build -v
build    27511  0.0  0.0 21474983812 22568 ?   R    00:57   0:00 ./src/osmo-msc/osmo-msc -c /build/doc/examples/osmo-msc/osmo-msc.cfg
build    27518  0.0  0.0   4280   700 ?        S    00:57   0:00 /bin/sh -c ps xua | grep osmo
build    27520  0.0  0.0  12784   992 ?        S    00:57   0:00 grep osmo

ok

----------------------------------------------------------------------
Ran 3 tests in 4.880s

OK
Connecting socket failed, retrying...
Socket: in 2 tries, connected to 127.0.0.1:4254 <socket.socket fd=5, family=AddressFamily.AF_INET, type=SocketKind.SOCK_STREAM, proto=0, laddr=('127.0.0.1', 41476), raddr=('127.0.0.1', 4254)> (1 sockets open)
Socket: closing 127.0.0.1:4254 <socket.socket fd=5, family=AddressFamily.AF_INET, type=SocketKind.SOCK_STREAM, proto=0, laddr=('127.0.0.1', 41476), raddr=('127.0.0.1', 4254)> (0 sockets open)
Terminating took 0.897s
IU=0 osmotestconfig.py -p /build -w /build -v
Verifying src/osmo-msc/osmo-msc -c /build/doc/examples/osmo-msc/osmo-msc.cfg, test verify_doc
Opening /dev/null
Launching: PWD=/build 'src/osmo-msc/osmo-msc' '-c' '/build/doc/examples/osmo-msc/osmo-msc.cfg'

> ls -l /proc/27522/fd
total 0
lr-x------ 1 build build 64 Aug 18 00:57 0 -> pipe:[466058872]
l-wx------ 1 build build 64 Aug 18 00:57 1 -> pipe:[466058873]
l-wx------ 1 build build 64 Aug 18 00:57 2 -> pipe:[466058874]
l-wx------ 1 build build 64 Aug 18 00:57 3 -> /dev/null


> ss -tn
Warning: doc/examples/osmo-msc/osmo-msc_custom-sccp.cfg is not being tested
Warning: doc/examples/osmo-msc/osmo-msc_multi-cs7.cfg is not being tested
State      Recv-Q Send-Q Local Address:Port               Peer Address:Port              


> ss -tln
State      Recv-Q Send-Q Local Address:Port               Peer Address:Port              


> ps xua | grep osmo
build    27522  0.0  0.0  53816 20764 ?        S    00:57   0:00 /usr/bin/python3 /usr/local/bin/osmotestconfig.py -p /build -w /build -v
build    27523  0.0  0.0 21474989440 26248 ?   D    00:57   0:00 src/osmo-msc/osmo-msc -c /build/doc/examples/osmo-msc/osmo-msc.cfg
build    27530  0.0  0.0   4280   792 ?        S    00:57   0:00 /bin/sh -c ps xua | grep osmo
build    27532  0.0  0.0   4280    84 ?        R    00:57   0:00 /bin/sh -c ps xua | grep osmo

Socket: in 1 tries, connected to 127.0.0.1:4254 <socket.socket fd=4, family=AddressFamily.AF_INET, type=SocketKind.SOCK_STREAM, proto=0, laddr=('127.0.0.1', 41480), raddr=('127.0.0.1', 4254)> (1 sockets open)
Terminating took 0.897s
Socket: closing 127.0.0.1:4254 <socket.socket fd=4, family=AddressFamily.AF_INET, type=SocketKind.SOCK_STREAM, proto=0, laddr=('127.0.0.1', 41480), raddr=('127.0.0.1', 4254)> (0 sockets open)
Verifying src/osmo-msc/osmo-msc -c /build/writtenconfig/osmo-msc.cfg88znxfvd, test write_config
Launching: PWD=/build 'src/osmo-msc/osmo-msc' '-c' '/build/writtenconfig/osmo-msc.cfg88znxfvd'

> ls -l /proc/27522/fd
total 0
lr-x------ 1 build build 64 Aug 18 00:57 0 -> pipe:[466058872]
l-wx------ 1 build build 64 Aug 18 00:57 1 -> pipe:[466058873]
l-wx------ 1 build build 64 Aug 18 00:57 2 -> pipe:[466058874]
l-wx------ 1 build build 64 Aug 18 00:57 3 -> /dev/null
Documentation error (missing docs): 
<command id='no mgw reset-endpoint NAME'>
        <param name='NAME' doc='(null)' />



> ss -tn
State      Recv-Q Send-Q Local Address:Port               Peer Address:Port              


> ss -tln
State      Recv-Q Send-Q Local Address:Port               Peer Address:Port              


> ps xua | grep osmo
build    27522  7.5  0.0  54260 21348 ?        S    00:57   0:00 /usr/bin/python3 /usr/local/bin/osmotestconfig.py -p /build -w /build -v
build    27534  0.0  0.0 21474983812 24224 ?   R    00:57   0:00 src/osmo-msc/osmo-msc -c /build/writtenconfig/osmo-msc.cfg88znxfvd
build    27541  0.0  0.0   4280   704 ?        S    00:57   0:00 /bin/sh -c ps xua | grep osmo
build    27543  0.0  0.0  12784   976 ?        S    00:57   0:00 grep osmo

Socket: in 1 tries, connected to 127.0.0.1:4254 <socket.socket fd=4, family=AddressFamily.AF_INET, type=SocketKind.SOCK_STREAM, proto=0, laddr=('127.0.0.1', 41486), raddr=('127.0.0.1', 4254)> (1 sockets open)
Terminating took 0.168s
Socket: closing 127.0.0.1:4254 <socket.socket fd=4, family=AddressFamily.AF_INET, type=SocketKind.SOCK_STREAM, proto=0, laddr=('127.0.0.1', 41486), raddr=('127.0.0.1', 4254)> (0 sockets open)
Verifying src/osmo-msc/osmo-msc -c /build/writtenconfig/osmo-msc.cfg88znxfvd, test token_vty_command
Launching: PWD=/build 'src/osmo-msc/osmo-msc' '-c' '/build/writtenconfig/osmo-msc.cfg88znxfvd'

> ls -l /proc/27522/fd
total 0
lr-x------ 1 build build 64 Aug 18 00:57 0 -> pipe:[466058872]
l-wx------ 1 build build 64 Aug 18 00:57 1 -> pipe:[466058873]
l-wx------ 1 build build 64 Aug 18 00:57 2 -> pipe:[466058874]
l-wx------ 1 build build 64 Aug 18 00:57 3 -> /dev/null


> ss -tn
State      Recv-Q Send-Q Local Address:Port               Peer Address:Port              


> ss -tln
State      Recv-Q Send-Q Local Address:Port               Peer Address:Port              


> ps xua | grep osmo
build    27522  5.0  0.0  54260 21348 ?        S    00:57   0:00 /usr/bin/python3 /usr/local/bin/osmotestconfig.py -p /build -w /build -v
build    27545  0.0  0.0 21474989064 24924 ?   R    00:57   0:00 src/osmo-msc/osmo-msc -c /build/writtenconfig/osmo-msc.cfg88znxfvd
build    27552  0.0  0.0   4280   792 ?        S    00:57   0:00 /bin/sh -c ps xua | grep osmo
build    27554  0.0  0.0  12784   948 ?        S    00:57   0:00 grep osmo

Socket: in 1 tries, connected to 127.0.0.1:4254 <socket.socket fd=4, family=AddressFamily.AF_INET, type=SocketKind.SOCK_STREAM, proto=0, laddr=('127.0.0.1', 41492), raddr=('127.0.0.1', 4254)> (1 sockets open)
Terminating took 0.897s
Socket: closing 127.0.0.1:4254 <socket.socket fd=4, family=AddressFamily.AF_INET, type=SocketKind.SOCK_STREAM, proto=0, laddr=('127.0.0.1', 41492), raddr=('127.0.0.1', 4254)> (0 sockets open)
ERRORS: 1
make[7]: *** [vty-python-test] Error 1
Makefile:720: recipe for target 'vty-python-test' failed
make[7]: Leaving directory '/build/tests'
Makefile:740: recipe for target 'vty-test' failed
make[6]: Leaving directory '/build/tests'
make[6]: *** [vty-test] Error 2
make[5]: *** [python-tests] Error 2
Makefile:710: recipe for target 'python-tests' failed
make[5]: Leaving directory '/build/tests'
make[4]: *** [check-local] Error 2
Makefile:763: recipe for target 'check-local' failed
make[4]: Leaving directory '/build/tests'
Makefile:569: recipe for target 'check-am' failed
make[3]: Leaving directory '/build/tests'
make[3]: *** [check-am] Error 2
make[2]: *** [check-recursive] Error 1
Makefile:421: recipe for target 'check-recursive' failed
make[2]: Leaving directory '/build/tests'
make[1]: *** [check-recursive] Error 1
Makefile:469: recipe for target 'check-recursive' failed
make[1]: Leaving directory '/build'
Makefile:760: recipe for target 'check' failed
make: *** [check] Error 2
+ cat-testlogs.sh
Build step 'Execute shell' marked build as failure
[WARNINGS]Skipping publisher since build result is FAILURE


More information about the jenkins-notifications mailing list