Build failed in Jenkins: master-osmo-msc » --disable-iu,1,a3=default,a4=default,osmocom-master-debian9 #25992

jenkins at lists.osmocom.org jenkins at lists.osmocom.org
Wed Aug 18 06:20:51 UTC 2021


See <https://jenkins.osmocom.org/jenkins/job/master-osmo-msc/IU=--disable-iu,WITH_MANUALS=1,a3=default,a4=default,label=osmocom-master-debian9/25992/display/redirect>

Changes:


------------------------------------------
[...truncated 429.77 KB...]
## osmo-msc 1.7.0.20-945b0 test suite. ##
## ----------------------------------- ##

Regression tests.

  1: smpp                                            ok
  2: sms_queue_test                                  ok
  3: db_sms_test                                     ok
  4: msc_vlr_test_no_authen                          ok
  5: msc_vlr_test_gsm_authen                         ok
  6: msc_vlr_test_gsm_ciph                           ok
  7: msc_vlr_test_umts_authen                        ok
  8: msc_vlr_test_authen_reuse                       ok
  9: msc_vlr_test_hlr_reject                         ok
 10: msc_vlr_test_hlr_timeout                        ok
 11: msc_vlr_test_ms_timeout                         ok
 12: msc_vlr_test_reject_concurrency                 ok
 13: msc_vlr_test_call                               ok
 14: msc_vlr_test_rest                               ok
 15: msc_vlr_test_ss                                 ok
 16: sdp_msg_test                                    ok
 17: mncc_test                                       ok

## ------------- ##
## Test results. ##
## ------------- ##

All 17 tests were successful.
make  python-tests
make[5]: Entering directory '/build/tests'
make vty-test
make[6]: Entering directory '/build/tests'
make vty-python-test
make[7]: Entering directory '/build/tests'
IU=0 osmotestvty.py -p /build -w /build -v
test_history (__main__.TestVTY) ... confpath /build, workdir /build
Running tests for specific VTY commands
Launch: ./src/osmo-msc/osmo-msc -c /build/doc/examples/osmo-msc/osmo-msc.cfg from /build
Opening /dev/null
Launching: PWD=/build './src/osmo-msc/osmo-msc' '-c' '/build/doc/examples/osmo-msc/osmo-msc.cfg'

> ls -l /proc/28159/fd
total 0
lr-x------ 1 build build 64 Aug 18 06:20 0 -> pipe:[1608008802]
l-wx------ 1 build build 64 Aug 18 06:20 1 -> pipe:[1608008803]
l-wx------ 1 build build 64 Aug 18 06:20 2 -> pipe:[1608008804]
l-wx------ 1 build build 64 Aug 18 06:20 3 -> /dev/null


> ss -tn
State      Recv-Q Send-Q Local Address:Port               Peer Address:Port              


> ss -tln
State      Recv-Q Send-Q Local Address:Port               Peer Address:Port              


> ps xua | grep osmo
build    28159  0.0  0.0  53720 20940 ?        S    06:20   0:00 /usr/bin/python3 /usr/local/bin/osmotestvty.py -p /build -w /build -v
build    28160  0.0  0.0 21474989440 36756 ?   D    06:20   0:00 ./src/osmo-msc/osmo-msc -c /build/doc/examples/osmo-msc/osmo-msc.cfg
build    28167  0.0  0.0   4280   708 ?        S    06:20   0:00 /bin/sh -c ps xua | grep osmo
build    28169  0.0  0.0  12784  1016 ?        S    06:20   0:00 grep osmo

ok
test_terminal_length (__main__.TestVTY) ... Socket: in 1 tries, connected to 127.0.0.1:4254 <socket.socket fd=4, family=AddressFamily.AF_INET, type=SocketKind.SOCK_STREAM, proto=0, laddr=('127.0.0.1', 57290), raddr=('127.0.0.1', 4254)> (1 sockets open)
Socket: closing 127.0.0.1:4254 <socket.socket fd=4, family=AddressFamily.AF_INET, type=SocketKind.SOCK_STREAM, proto=0, laddr=('127.0.0.1', 57290), raddr=('127.0.0.1', 4254)> (0 sockets open)
Terminating took 1.415s
Launch: ./src/osmo-msc/osmo-msc -c /build/doc/examples/osmo-msc/osmo-msc.cfg from /build
Launching: PWD=/build './src/osmo-msc/osmo-msc' '-c' '/build/doc/examples/osmo-msc/osmo-msc.cfg'

> ls -l /proc/28159/fd
total 0
lr-x------ 1 build build 64 Aug 18 06:20 0 -> pipe:[1608008802]
l-wx------ 1 build build 64 Aug 18 06:20 1 -> pipe:[1608008803]
l-wx------ 1 build build 64 Aug 18 06:20 2 -> pipe:[1608008804]
l-wx------ 1 build build 64 Aug 18 06:20 3 -> /dev/null


> ss -tn
State      Recv-Q Send-Q Local Address:Port               Peer Address:Port              


> ss -tln
State      Recv-Q Send-Q Local Address:Port               Peer Address:Port              


> ps xua | grep osmo
build    28159  5.5  0.0  53720 21028 ?        S    06:20   0:00 /usr/bin/python3 /usr/local/bin/osmotestvty.py -p /build -w /build -v
build    28171  0.0  0.0 21474989440 39376 ?   D    06:20   0:00 ./src/osmo-msc/osmo-msc -c /build/doc/examples/osmo-msc/osmo-msc.cfg
build    28178  0.0  0.0   4280   716 ?        S    06:20   0:00 /bin/sh -c ps xua | grep osmo
build    28180  0.0  0.0  12784   964 ?        S    06:20   0:00 grep osmo

ok
test_unknown_command (__main__.TestVTY) ... Socket: in 1 tries, connected to 127.0.0.1:4254 <socket.socket fd=4, family=AddressFamily.AF_INET, type=SocketKind.SOCK_STREAM, proto=0, laddr=('127.0.0.1', 57338), raddr=('127.0.0.1', 4254)> (1 sockets open)
Socket: closing 127.0.0.1:4254 <socket.socket fd=4, family=AddressFamily.AF_INET, type=SocketKind.SOCK_STREAM, proto=0, laddr=('127.0.0.1', 57338), raddr=('127.0.0.1', 4254)> (0 sockets open)
Terminating took 0.897s
Launch: ./src/osmo-msc/osmo-msc -c /build/doc/examples/osmo-msc/osmo-msc.cfg from /build
Launching: PWD=/build './src/osmo-msc/osmo-msc' '-c' '/build/doc/examples/osmo-msc/osmo-msc.cfg'

> ls -l /proc/28159/fd
total 0
lr-x------ 1 build build 64 Aug 18 06:20 0 -> pipe:[1608008802]
l-wx------ 1 build build 64 Aug 18 06:20 1 -> pipe:[1608008803]
l-wx------ 1 build build 64 Aug 18 06:20 2 -> pipe:[1608008804]
l-wx------ 1 build build 64 Aug 18 06:20 3 -> /dev/null


> ss -tn
State      Recv-Q Send-Q Local Address:Port               Peer Address:Port              


> ss -tln
State      Recv-Q Send-Q Local Address:Port               Peer Address:Port              


> ps xua | grep osmo
build    28159  2.7  0.0  53720 21028 ?        S    06:20   0:00 /usr/bin/python3 /usr/local/bin/osmotestvty.py -p /build -w /build -v
build    28182  0.0  0.0 21474989440 37596 ?   D    06:20   0:00 ./src/osmo-msc/osmo-msc -c /build/doc/examples/osmo-msc/osmo-msc.cfg
build    28189  0.0  0.0   4280   700 ?        S    06:20   0:00 /bin/sh -c ps xua | grep osmo
build    28191  0.0  0.0  12784   960 ?        S    06:20   0:00 grep osmo

ok

----------------------------------------------------------------------
Ran 3 tests in 5.228s

OK
Socket: in 1 tries, connected to 127.0.0.1:4254 <socket.socket fd=4, family=AddressFamily.AF_INET, type=SocketKind.SOCK_STREAM, proto=0, laddr=('127.0.0.1', 57384), raddr=('127.0.0.1', 4254)> (1 sockets open)
Socket: closing 127.0.0.1:4254 <socket.socket fd=4, family=AddressFamily.AF_INET, type=SocketKind.SOCK_STREAM, proto=0, laddr=('127.0.0.1', 57384), raddr=('127.0.0.1', 4254)> (0 sockets open)
Terminating took 0.897s
IU=0 osmotestconfig.py -p /build -w /build -v
Verifying src/osmo-msc/osmo-msc -c /build/doc/examples/osmo-msc/osmo-msc.cfg, test verify_doc
Opening /dev/null
Launching: PWD=/build 'src/osmo-msc/osmo-msc' '-c' '/build/doc/examples/osmo-msc/osmo-msc.cfg'

> ls -l /proc/28193/fd
total 0
lr-x------ 1 build build 64 Aug 18 06:20 0 -> pipe:[1608008802]
l-wx------ 1 build build 64 Aug 18 06:20 1 -> pipe:[1608008803]
l-wx------ 1 build build 64 Aug 18 06:20 2 -> pipe:[1608008804]
l-wx------ 1 build build 64 Aug 18 06:20 3 -> /dev/null
Warning: doc/examples/osmo-msc/osmo-msc_multi-cs7.cfg is not being tested
Warning: doc/examples/osmo-msc/osmo-msc_custom-sccp.cfg is not being tested


> ss -tn
State      Recv-Q Send-Q Local Address:Port               Peer Address:Port              


> ss -tln
State      Recv-Q Send-Q Local Address:Port               Peer Address:Port              


> ps xua | grep osmo
build    28193  0.0  0.0  53708 20772 ?        S    06:20   0:00 /usr/bin/python3 /usr/local/bin/osmotestconfig.py -p /build -w /build -v
build    28194  0.0  0.0 21474983812 35588 ?   R    06:20   0:00 src/osmo-msc/osmo-msc -c /build/doc/examples/osmo-msc/osmo-msc.cfg
build    28201  0.0  0.0   4280   740 ?        S    06:20   0:00 /bin/sh -c ps xua | grep osmo
build    28203  0.0  0.0  12784   964 ?        S    06:20   0:00 grep osmo

Socket: in 1 tries, connected to 127.0.0.1:4254 <socket.socket fd=4, family=AddressFamily.AF_INET, type=SocketKind.SOCK_STREAM, proto=0, laddr=('127.0.0.1', 57418), raddr=('127.0.0.1', 4254)> (1 sockets open)
Terminating took 0.897s
Socket: closing 127.0.0.1:4254 <socket.socket fd=4, family=AddressFamily.AF_INET, type=SocketKind.SOCK_STREAM, proto=0, laddr=('127.0.0.1', 57418), raddr=('127.0.0.1', 4254)> (0 sockets open)
Verifying src/osmo-msc/osmo-msc -c /build/writtenconfig/osmo-msc.cfgdore6mar, test write_config
Launching: PWD=/build 'src/osmo-msc/osmo-msc' '-c' '/build/writtenconfig/osmo-msc.cfgdore6mar'

> ls -l /proc/28193/fd
total 0
lr-x------ 1 build build 64 Aug 18 06:20 0 -> pipe:[1608008802]
l-wx------ 1 build build 64 Aug 18 06:20 1 -> pipe:[1608008803]
l-wx------ 1 build build 64 Aug 18 06:20 2 -> pipe:[1608008804]
l-wx------ 1 build build 64 Aug 18 06:20 3 -> /dev/null


> ss -tn
Documentation error (missing docs): 
<command id='no mgw reset-endpoint NAME'>
        <param name='NAME' doc='(null)' />

State      Recv-Q Send-Q Local Address:Port               Peer Address:Port              


> ss -tln
State      Recv-Q Send-Q Local Address:Port               Peer Address:Port              


> ps xua | grep osmo
build    28193  7.0  0.0  54180 21296 ?        S    06:20   0:00 /usr/bin/python3 /usr/local/bin/osmotestconfig.py -p /build -w /build -v
build    28205  0.0  0.0 21474983812 32152 ?   R    06:20   0:00 src/osmo-msc/osmo-msc -c /build/writtenconfig/osmo-msc.cfgdore6mar
build    28212  0.0  0.0   4280   704 ?        S    06:20   0:00 /bin/sh -c ps xua | grep osmo
build    28214  0.0  0.0  12784   972 ?        S    06:20   0:00 grep osmo

Socket: in 1 tries, connected to 127.0.0.1:4254 <socket.socket fd=4, family=AddressFamily.AF_INET, type=SocketKind.SOCK_STREAM, proto=0, laddr=('127.0.0.1', 57442), raddr=('127.0.0.1', 4254)> (1 sockets open)
Terminating took 0.897s
Socket: closing 127.0.0.1:4254 <socket.socket fd=4, family=AddressFamily.AF_INET, type=SocketKind.SOCK_STREAM, proto=0, laddr=('127.0.0.1', 57442), raddr=('127.0.0.1', 4254)> (0 sockets open)
Verifying src/osmo-msc/osmo-msc -c /build/writtenconfig/osmo-msc.cfgdore6mar, test token_vty_command
Launching: PWD=/build 'src/osmo-msc/osmo-msc' '-c' '/build/writtenconfig/osmo-msc.cfgdore6mar'

> ls -l /proc/28193/fd
total 0
lr-x------ 1 build build 64 Aug 18 06:20 0 -> pipe:[1608008802]
l-wx------ 1 build build 64 Aug 18 06:20 1 -> pipe:[1608008803]
l-wx------ 1 build build 64 Aug 18 06:20 2 -> pipe:[1608008804]
l-wx------ 1 build build 64 Aug 18 06:20 3 -> /dev/null


> ss -tn
State      Recv-Q Send-Q Local Address:Port               Peer Address:Port              


> ss -tln
State      Recv-Q Send-Q Local Address:Port               Peer Address:Port              


> ps xua | grep osmo
build    28193  4.6  0.0  54180 21296 ?        S    06:20   0:00 /usr/bin/python3 /usr/local/bin/osmotestconfig.py -p /build -w /build -v
build    28216  0.0  0.0 21474989440 37684 ?   D    06:20   0:00 src/osmo-msc/osmo-msc -c /build/writtenconfig/osmo-msc.cfgdore6mar
build    28223  0.0  0.0   4280   712 ?        S    06:20   0:00 /bin/sh -c ps xua | grep osmo
build    28225  0.0  0.0  12784   968 ?        S    06:20   0:00 grep osmo

ERRORS: 1
Socket: in 1 tries, connected to 127.0.0.1:4254 <socket.socket fd=4, family=AddressFamily.AF_INET, type=SocketKind.SOCK_STREAM, proto=0, laddr=('127.0.0.1', 57468), raddr=('127.0.0.1', 4254)> (1 sockets open)
Terminating took 0.897s
Socket: closing 127.0.0.1:4254 <socket.socket fd=4, family=AddressFamily.AF_INET, type=SocketKind.SOCK_STREAM, proto=0, laddr=('127.0.0.1', 57468), raddr=('127.0.0.1', 4254)> (0 sockets open)
Makefile:720: recipe for target 'vty-python-test' failed
make[7]: Leaving directory '/build/tests'
make[7]: *** [vty-python-test] Error 1
make[6]: *** [vty-test] Error 2
Makefile:740: recipe for target 'vty-test' failed
make[6]: Leaving directory '/build/tests'
Makefile:710: recipe for target 'python-tests' failed
make[5]: Leaving directory '/build/tests'
make[5]: *** [python-tests] Error 2
Makefile:763: recipe for target 'check-local' failed
make[4]: *** [check-local] Error 2
make[4]: Leaving directory '/build/tests'
Makefile:569: recipe for target 'check-am' failed
make[3]: Leaving directory '/build/tests'
make[3]: *** [check-am] Error 2
Makefile:421: recipe for target 'check-recursive' failed
make[2]: Leaving directory '/build/tests'
make[2]: *** [check-recursive] Error 1
Makefile:469: recipe for target 'check-recursive' failed
make[1]: Leaving directory '/build'
make[1]: *** [check-recursive] Error 1
Makefile:760: recipe for target 'check' failed
make: *** [check] Error 2
+ cat-testlogs.sh
Build step 'Execute shell' marked build as failure
[WARNINGS]Skipping publisher since build result is FAILURE


More information about the jenkins-notifications mailing list