Build failed in Jenkins: osmo-gsm-tester_build-osmo-msc #39986
See <https://jenkins.osmocom.org/jenkins/job/osmo-gsm-tester_build-osmo-msc/39986/display/redirect>
Changes:
------------------------------------------
Started by upstream project "master-osmo-msc" build number 48809
originally caused by:
Started by upstream project "master-osmo-mgw" build number 13170
originally caused by:
Started by timer
Running as SYSTEM
Building remotely on build5-deb12build-ansible (obs ttcn3_with_linux_6.1_or_higher qemu registry-build-amd64 ttcn3 osmo-gsm-tester-build ttcn3-ggsn-test-kernel-git io_uring osmocom-gerrit coverity osmocom-master) in workspace <https://jenkins.osmocom.org/jenkins/job/osmo-gsm-tester_build-osmo-msc/ws/>
The recommended git tool is: NONE
No credentials specified
> git rev-parse --resolve-git-dir <https://jenkins.osmocom.org/jenkins/job/osmo-gsm-tester_build-osmo-msc/ws/osmo-gsm-tester/.git> # timeout=10
Fetching changes from the remote Git repository
> git config remote.origin.url https://gerrit.osmocom.org/osmo-gsm-tester # timeout=10
Fetching upstream changes from https://gerrit.osmocom.org/osmo-gsm-tester
> git --version # timeout=10
> git --version # 'git version 2.39.5'
> git fetch --tags --force --progress -- https://gerrit.osmocom.org/osmo-gsm-tester +refs/heads/*:refs/remotes/origin/* # timeout=10
> git rev-parse origin/master^{commit} # timeout=10
Checking out Revision f7d64b0bcf946ec21ce9c7562194343a12213a80 (origin/master)
> git config core.sparsecheckout # timeout=10
> git checkout -f f7d64b0bcf946ec21ce9c7562194343a12213a80 # timeout=10
Commit message: "jenkins.sh: libosmo-netif no longer depends on libosmo-abis"
> git rev-list --no-walk f7d64b0bcf946ec21ce9c7562194343a12213a80 # timeout=10
[osmo-gsm-tester_build-osmo-msc] $ /bin/sh -xe /tmp/jenkins5137387030570780536.sh
+ rm -rf docker-playground
+ git clone --depth=1 --branch=master https://gerrit.osmocom.org/docker-playground docker-playground
Cloning into 'docker-playground'...
+ git -C docker-playground log --oneline
aaf623e Use debian/eol:buster instead of debian:buster
+ make -C docker-playground/osmo-gsm-tester
make: Entering directory '<https://jenkins.osmocom.org/jenkins/job/osmo-gsm-tester_build-osmo-msc/ws/docker-playground/osmo-gsm-tester'>
awk: fatal: cannot open file `.release' for reading: No such file or directory
awk: fatal: cannot open file `.release' for reading: No such file or directory
awk: fatal: cannot open file `.release' for reading: No such file or directory
rm -rf .common
cp -r <https://jenkins.osmocom.org/jenkins/job/osmo-gsm-tester_build-osmo-msc/ws/docker-playground/common> .common
INFO: .release created
release=0.0.0
docker build \
--build-arg USER=osmocom-build \
--build-arg UID=1000 \
--build-arg REGISTRY=docker.io \
--build-arg OSMO_TTCN3_BRANCH=master \
--build-arg UPSTREAM_DISTRO=debian:bookworm \
--build-arg DISTRO=debian-bookworm \
--build-arg OSMOCOM_REPO_MIRROR=https://downloads.osmocom.org \
--build-arg OSMOCOM_REPO_PATH=packages/osmocom: \
--build-arg OSMOCOM_REPO_VERSION=latest \
--build-arg OSMOCOM_REPO_TESTSUITE_MIRROR=https://downloads.osmocom.org \
--build-arg ASTERISK_BRANCH=sysmocom/20.7.0 \
--build-arg LIBOSMOCORE_BRANCH=master \
--build-arg OSMO_BB_BRANCH=master \
--build-arg OSMO_BSC_BRANCH=master \
--build-arg OSMO_BTS_BRANCH=master \
--build-arg OSMO_CBC_BRANCH=master \
--build-arg OSMO_DIA2GSUP_BRANCH=master \
--build-arg OSMO_EPDG_BRANCH=master \
--build-arg OSMO_GBPROXY_BRANCH=master \
--build-arg OSMO_GGSN_BRANCH=master \
--build-arg OSMO_GSM_TESTER_BRANCH=master \
--build-arg OSMO_HLR_BRANCH=master \
--build-arg OSMO_HNBGW_BRANCH=master \
--build-arg OSMO_HNODEB_BRANCH=master \
--build-arg OSMO_IUH_BRANCH=master \
--build-arg OSMO_MGW_BRANCH=master \
--build-arg OSMO_MSC_BRANCH=master \
--build-arg OSMO_NITB_BRANCH=master \
--build-arg OSMO_PCU_BRANCH=master \
--build-arg OSMO_REMSIM_BRANCH=master \
--build-arg OSMO_SGSN_BRANCH=master \
--build-arg OSMO_SIP_BRANCH=master \
--build-arg OSMO_STP_BRANCH=master \
--build-arg OSMO_UECUPS_BRANCH=master \
--build-arg OPEN5GS_BRANCH=main \
--build-arg PJPROJECT_BRANCH=sysmocom/2.14 \
-t docker.io/osmocom-build/osmo-gsm-tester:latest .
#0 building with "default" instance using docker driver
#1 [internal] load build definition from Dockerfile
#1 transferring dockerfile: 4.84kB done
#1 WARN: InvalidDefaultArgInFrom: Default value for ARG $USER/debian-bookworm-build results in empty or invalid base image name (line 2)
#1 DONE 0.1s
#2 [internal] load metadata for docker.io/osmocom-build/debian-bookworm-build:latest
#2 DONE 0.0s
#3 [internal] load .dockerignore
#3 transferring context:
#3 transferring context: 2B done
#3 DONE 0.1s
#4 [ 1/28] FROM docker.io/osmocom-build/debian-bookworm-build:latest
#4 DONE 0.0s
#5 [internal] load build context
#5 transferring context: 5.76kB done
#5 DONE 0.1s
#6 [22/28] ADD HTTPS://GERRIT.OSMOCOM.ORG/PLUGINS/GITILES/OSMO-GSM-TESTER/+/MASTER?FORMAT=TEXT /tmp/commit
#6 DONE 0.2s
#7 [ 2/28] RUN useradd -ms /bin/bash jenkins
#7 CACHED
#8 [12/28] RUN MKDIR -p /osmo-gsm-tester-srsue /osmo-gsm-tester-srsenb /osmo-gsm-tester-srsepc /osmo-gsm-tester-trx /osmo-gsm-tester-grbroker /osmo-gsm-tester-open5gs
#8 CACHED
#9 [ 3/28] RUN groupadd osmo-gsm-tester
#9 CACHED
#10 [ 9/28] COPY SSH /root/.ssh
#10 CACHED
#11 [ 5/28] RUN APT-GET update && apt-get install -y --no-install-recommends cpio dbus tcpdump sqlite3 python3 python3-setuptools python3-yaml python3-mako python3-gi python3-numpy python3-wheel python3-watchdog ofono patchelf rpm2cpio sudo libcap2-bin python3-pip udhcpc iperf3 locales
#11 CACHED
#12 [13/28] RUN CHOWN -R jenkins:jenkins /osmo-gsm-tester-*
#12 CACHED
#13 [14/28] RUN sed -i -e 's/# en_US.UTF-8 UTF-8/en_US.UTF-8 UTF-8/' /etc/locale.gen && dpkg-reconfigure --frontend=noninteractive locales && update-locale LANG=en_US.UTF-8
#13 CACHED
#14 [ 8/28] RUN MKDIR /var/run/sshd
#14 CACHED
#15 [ 6/28] RUN PIP3 install --break-system-packages "git+https://github.com/podshumok/python-smpplib.git@master#egg=smpplib" pydbus pyusb pysispm pymongo
#15 CACHED
#16 [15/28] RUN APT-GET update && apt-get install -y --no-install-recommends telnet libosmocore-dev libosmo-abis-dev libosmo-gsup-client-dev libosmo-netif-dev libosmo-ranap-dev libosmo-sigtran-dev libsmpp34-dev libgtp-dev libasn1c-dev && apt-get clean
#16 CACHED
#17 [16/28] RUN APT-GET update && apt-get install -y --no-install-recommends cmake libfftw3-dev libmbedtls-dev libboost-program-options-dev libconfig++-dev libsctp-dev libpcsclite-dev libuhd-dev libczmq-dev libsoapysdr-dev soapysdr-module-lms7 && apt-get clean
#17 CACHED
#18 [10/28] COPY --CHOWN=JENKINS:JENKINS ssh /home/jenkins/.ssh
#18 CACHED
#19 [11/28] RUN chmod -R 0700 /home/jenkins/.ssh /root/.ssh
#19 CACHED
#20 [ 7/28] RUN APT-GET update && apt-get install -y openssh-server
#20 CACHED
#21 [ 4/28] RUN usermod -a -G osmo-gsm-tester jenkins
#21 CACHED
#22 [17/28] RUN APT-GET update && apt-get install -y --no-install-recommends gnuradio && apt-get clean
#22 CACHED
#6 [22/28] ADD HTTPS://GERRIT.OSMOCOM.ORG/PLUGINS/GITILES/OSMO-GSM-TESTER/+/MASTER?FORMAT=TEXT /tmp/commit
#6 CACHED
#23 [18/28] RUN SET -x && mkdir -p /tmp/mongodb && cd /tmp/mongodb && wget "https://pgp.mongodb.com/server-5.0.asc" -O "/mongodb.key" && wget "http://security.debian.org/debian-security/pool/updates/main/o/openssl/libssl1.1_1.1.1n-0+deb10u6_amd64.deb" && dpkg -i "libssl1.1_1.1.1n-0+deb10u6_amd64.deb" && echo "deb [signed-by=/mongodb.key] http://repo.mongodb.org/apt/debian bullseye/mongodb-org/5.0 main" > /etc/apt/sources.list.d/mongodb-org.list && apt-get update && apt-get install -y mongodb-org && apt-get clean && cd / && rm -rf /tmp/mongodb && rm /etc/apt/sources.list.d/mongodb-org.list && sed -i "s/127.0.0.1/172.18.50.2/g" /etc/mongod.conf
#23 0.341 + mkdir -p /tmp/mongodb
#23 0.342 + cd /tmp/mongodb
#23 0.342 + wget https://pgp.mongodb.com/server-5.0.asc -O /mongodb.key
#23 0.343 --2025-07-29 08:36:14-- https://pgp.mongodb.com/server-5.0.asc
#23 0.348 Resolving pgp.mongodb.com (pgp.mongodb.com)... 99.84.152.76, 99.84.152.50, 99.84.152.69, ...
#23 0.398 Connecting to pgp.mongodb.com (pgp.mongodb.com)|99.84.152.76|:443... connected.
#23 0.419 HTTP request sent, awaiting response... 200 OK
#23 0.720 Length: 1656 (1.6K) [binary/octet-stream]
#23 0.720 Saving to: ‘/mongodb.key’
#23 0.720
#23 0.720 0K . 100% 56.9M=0s
#23 0.720
#23 0.721 2025-07-29 08:36:15 (56.9 MB/s) - ‘/mongodb.key’ saved [1656/1656]
#23 0.721
#23 0.722 + wget http://security.debian.org/debian-security/pool/updates/main/o/openssl/libssl1.1_1.1.1n-0+deb10u6_amd64.deb
#23 0.728 --2025-07-29 08:36:15-- http://security.debian.org/debian-security/pool/updates/main/o/openssl/libssl1.1_1.1.1n-0+deb10u6_amd64.deb
#23 0.728 Resolving security.debian.org (security.debian.org)... 151.101.194.132, 151.101.2.132, 151.101.66.132, ...
#23 0.729 Connecting to security.debian.org (security.debian.org)|151.101.194.132|:80... connected.
#23 0.734 HTTP request sent, awaiting response... 404 Not Found
#23 0.749 2025-07-29 08:36:15 ERROR 404: Not Found.
#23 0.749
#23 ERROR: process "/bin/sh -c set -x && \tmkdir -p /tmp/mongodb && \tcd /tmp/mongodb && \twget \"https://pgp.mongodb.com/server-5.0.asc\" -O \"/mongodb.key\" && \twget \"http://security.debian.org/debian-security/pool/updates/main/o/openssl/libssl1.1_1.1.1n-0+deb10u6_amd64.deb\" && \tdpkg -i \"libssl1.1_1.1.1n-0+deb10u6_amd64.deb\" && \techo \"deb [signed-by=/mongodb.key] http://repo.mongodb.org/apt/debian bullseye/mongodb-org/5.0 main\" \t\t> /etc/apt/sources.list.d/mongodb-org.list && \tapt-get update && \tapt-get install -y mongodb-org && \tapt-get clean && \tcd / && \trm -rf /tmp/mongodb && \trm /etc/apt/sources.list.d/mongodb-org.list && \tsed -i \"s/127.0.0.1/$OGT_MASTER_ADDR/g\" /etc/mongod.conf" did not complete successfully: exit code: 8
------
> [18/28] RUN SET -x && mkdir -p /tmp/mongodb && cd /tmp/mongodb && wget "https://pgp.mongodb.com/server-5.0.asc" -O "/mongodb.key" && wget "http://security.debian.org/debian-security/pool/updates/main/o/openssl/libssl1.1_1.1.1n-0+deb10u6_amd64.deb" && dpkg -i "libssl1.1_1.1.1n-0+deb10u6_amd64.deb" && echo "deb [signed-by=/mongodb.key] http://repo.mongodb.org/apt/debian bullseye/mongodb-org/5.0 main" > /etc/apt/sources.list.d/mongodb-org.list && apt-get update && apt-get install -y mongodb-org && apt-get clean && cd / && rm -rf /tmp/mongodb && rm /etc/apt/sources.list.d/mongodb-org.list && sed -i "s/127.0.0.1/172.18.50.2/g" /etc/mongod.conf:
0.720
0.721 2025-07-29 08:36:15 (56.9 MB/s) - ‘/mongodb.key’ saved [1656/1656]
0.721
0.722 + wget http://security.debian.org/debian-security/pool/updates/main/o/openssl/libssl1.1_1.1.1n-0+deb10u6_amd64.deb
0.728 --2025-07-29 08:36:15-- http://security.debian.org/debian-security/pool/updates/main/o/openssl/libssl1.1_1.1.1n-0+deb10u6_amd64.deb
0.728 Resolving security.debian.org (security.debian.org)... 151.101.194.132, 151.101.2.132, 151.101.66.132, ...
0.729 Connecting to security.debian.org (security.debian.org)|151.101.194.132|:80... connected.
0.734 HTTP request sent, awaiting response... 404 Not Found
0.749 2025-07-29 08:36:15 ERROR 404: Not Found.
0.749
------
Dockerfile:105
--------------------
104 | # package is not available. Furthermore, manually install required libssl1.1.
105 | >>> RUN set -x && \
106 | >>> mkdir -p /tmp/mongodb && \
107 | >>> cd /tmp/mongodb && \
108 | >>> wget "https://pgp.mongodb.com/server-5.0.asc" -O "/mongodb.key" && \
109 | >>> wget "http://security.debian.org/debian-security/pool/updates/main/o/openssl/libssl1.1_1.1.1n-0+deb10u6_amd64.deb" && \
110 | >>> dpkg -i "libssl1.1_1.1.1n-0+deb10u6_amd64.deb" && \
111 | >>> echo "deb [signed-by=/mongodb.key] http://repo.mongodb.org/apt/debian bullseye/mongodb-org/5.0 main" \
112 | >>> > /etc/apt/sources.list.d/mongodb-org.list && \
113 | >>> apt-get update && \
114 | >>> apt-get install -y mongodb-org && \
115 | >>> apt-get clean && \
116 | >>> cd / && \
117 | >>> rm -rf /tmp/mongodb && \
118 | >>> rm /etc/apt/sources.list.d/mongodb-org.list && \
119 | >>> sed -i "s/127.0.0.1/$OGT_MASTER_ADDR/g" /etc/mongod.conf
120 |
--------------------
ERROR: failed to solve: process "/bin/sh -c set -x && \tmkdir -p /tmp/mongodb && \tcd /tmp/mongodb && \twget \"https://pgp.mongodb.com/server-5.0.asc\" -O \"/mongodb.key\" && \twget \"http://security.debian.org/debian-security/pool/updates/main/o/openssl/libssl1.1_1.1.1n-0+deb10u6_amd64.deb\" && \tdpkg -i \"libssl1.1_1.1.1n-0+deb10u6_amd64.deb\" && \techo \"deb [signed-by=/mongodb.key] http://repo.mongodb.org/apt/debian bullseye/mongodb-org/5.0 main\" \t\t> /etc/apt/sources.list.d/mongodb-org.list && \tapt-get update && \tapt-get install -y mongodb-org && \tapt-get clean && \tcd / && \trm -rf /tmp/mongodb && \trm /etc/apt/sources.list.d/mongodb-org.list && \tsed -i \"s/127.0.0.1/$OGT_MASTER_ADDR/g\" /etc/mongod.conf" did not complete successfully: exit code: 8
make: *** [../make/Makefile:95: docker-build] Error 1
make: Leaving directory '<https://jenkins.osmocom.org/jenkins/job/osmo-gsm-tester_build-osmo-msc/ws/docker-playground/osmo-gsm-tester'>
Build step 'Execute shell' marked build as failure
Skipped archiving because build is not successful
See <https://jenkins.osmocom.org/jenkins/job/osmo-gsm-tester_build-osmo-msc/39987/display/redirect>
Changes:
------------------------------------------
Started by upstream project "master-osmo-msc" build number 48810
originally caused by:
Started by upstream project "master-osmo-iuh" build number 18568
originally caused by:
Started by timer
Running as SYSTEM
Building remotely on build4-deb12build-ansible (registry-build-amd64 ttcn3 obs osmo-gsm-tester-build ttcn3_with_linux_6.1_or_higher qemu io_uring osmocom-gerrit coverity osmocom-master) in workspace <https://jenkins.osmocom.org/jenkins/job/osmo-gsm-tester_build-osmo-msc/ws/>
The recommended git tool is: NONE
No credentials specified
> git rev-parse --resolve-git-dir <https://jenkins.osmocom.org/jenkins/job/osmo-gsm-tester_build-osmo-msc/ws/osmo-gsm-tester/.git> # timeout=10
Fetching changes from the remote Git repository
> git config remote.origin.url https://gerrit.osmocom.org/osmo-gsm-tester # timeout=10
Fetching upstream changes from https://gerrit.osmocom.org/osmo-gsm-tester
> git --version # timeout=10
> git --version # 'git version 2.39.5'
> git fetch --tags --force --progress -- https://gerrit.osmocom.org/osmo-gsm-tester +refs/heads/*:refs/remotes/origin/* # timeout=10
> git rev-parse origin/master^{commit} # timeout=10
Checking out Revision f7d64b0bcf946ec21ce9c7562194343a12213a80 (origin/master)
> git config core.sparsecheckout # timeout=10
> git checkout -f f7d64b0bcf946ec21ce9c7562194343a12213a80 # timeout=10
Commit message: "jenkins.sh: libosmo-netif no longer depends on libosmo-abis"
> git rev-list --no-walk f7d64b0bcf946ec21ce9c7562194343a12213a80 # timeout=10
[osmo-gsm-tester_build-osmo-msc] $ /bin/sh -xe /tmp/jenkins14041913552800719833.sh
+ rm -rf docker-playground
+ git clone --depth=1 --branch=master https://gerrit.osmocom.org/docker-playground docker-playground
Cloning into 'docker-playground'...
+ git -C docker-playground log --oneline
aaf623e Use debian/eol:buster instead of debian:buster
+ make -C docker-playground/osmo-gsm-tester
make: Entering directory '<https://jenkins.osmocom.org/jenkins/job/osmo-gsm-tester_build-osmo-msc/ws/docker-playground/osmo-gsm-tester'>
awk: fatal: cannot open file `.release' for reading: No such file or directory
awk: fatal: cannot open file `.release' for reading: No such file or directory
awk: fatal: cannot open file `.release' for reading: No such file or directory
rm -rf .common
cp -r <https://jenkins.osmocom.org/jenkins/job/osmo-gsm-tester_build-osmo-msc/ws/docker-playground/common> .common
INFO: .release created
release=0.0.0
docker build \
--build-arg USER=osmocom-build \
--build-arg UID=1000 \
--build-arg REGISTRY=docker.io \
--build-arg OSMO_TTCN3_BRANCH=master \
--build-arg UPSTREAM_DISTRO=debian:bookworm \
--build-arg DISTRO=debian-bookworm \
--build-arg OSMOCOM_REPO_MIRROR=https://downloads.osmocom.org \
--build-arg OSMOCOM_REPO_PATH=packages/osmocom: \
--build-arg OSMOCOM_REPO_VERSION=latest \
--build-arg OSMOCOM_REPO_TESTSUITE_MIRROR=https://downloads.osmocom.org \
--build-arg ASTERISK_BRANCH=sysmocom/20.7.0 \
--build-arg LIBOSMOCORE_BRANCH=master \
--build-arg OSMO_BB_BRANCH=master \
--build-arg OSMO_BSC_BRANCH=master \
--build-arg OSMO_BTS_BRANCH=master \
--build-arg OSMO_CBC_BRANCH=master \
--build-arg OSMO_DIA2GSUP_BRANCH=master \
--build-arg OSMO_EPDG_BRANCH=master \
--build-arg OSMO_GBPROXY_BRANCH=master \
--build-arg OSMO_GGSN_BRANCH=master \
--build-arg OSMO_GSM_TESTER_BRANCH=master \
--build-arg OSMO_HLR_BRANCH=master \
--build-arg OSMO_HNBGW_BRANCH=master \
--build-arg OSMO_HNODEB_BRANCH=master \
--build-arg OSMO_IUH_BRANCH=master \
--build-arg OSMO_MGW_BRANCH=master \
--build-arg OSMO_MSC_BRANCH=master \
--build-arg OSMO_NITB_BRANCH=master \
--build-arg OSMO_PCU_BRANCH=master \
--build-arg OSMO_REMSIM_BRANCH=master \
--build-arg OSMO_SGSN_BRANCH=master \
--build-arg OSMO_SIP_BRANCH=master \
--build-arg OSMO_STP_BRANCH=master \
--build-arg OSMO_UECUPS_BRANCH=master \
--build-arg OPEN5GS_BRANCH=main \
--build-arg PJPROJECT_BRANCH=sysmocom/2.14 \
-t docker.io/osmocom-build/osmo-gsm-tester:latest .
#0 building with "default" instance using docker driver
#1 [internal] load build definition from Dockerfile
#1 transferring dockerfile: 4.84kB done
#1 WARN: InvalidDefaultArgInFrom: Default value for ARG $USER/debian-bookworm-build results in empty or invalid base image name (line 2)
#1 WARN: LegacyKeyValueFormat: "ENV key=value" should be used instead of legacy "ENV key value" format (line 65)
#1 DONE 0.0s
#2 [internal] load metadata for docker.io/osmocom-build/debian-bookworm-build:latest
#2 DONE 0.0s
#3 [internal] load .dockerignore
#3 transferring context: 2B done
#3 DONE 0.0s
#4 [ 1/28] FROM docker.io/osmocom-build/debian-bookworm-build:latest
#4 DONE 0.0s
#5 [internal] load build context
#5 transferring context: 5.76kB done
#5 DONE 0.0s
#6 [22/28] ADD HTTPS://GERRIT.OSMOCOM.ORG/PLUGINS/GITILES/OSMO-GSM-TESTER/+/MASTER?FORMAT=TEXT /tmp/commit
#6 CACHED
#7 [ 3/28] RUN groupadd osmo-gsm-tester
#7 CACHED
#8 [12/28] RUN MKDIR -p /osmo-gsm-tester-srsue /osmo-gsm-tester-srsenb /osmo-gsm-tester-srsepc /osmo-gsm-tester-trx /osmo-gsm-tester-grbroker /osmo-gsm-tester-open5gs
#8 CACHED
#9 [ 5/28] RUN APT-GET update && apt-get install -y --no-install-recommends cpio dbus tcpdump sqlite3 python3 python3-setuptools python3-yaml python3-mako python3-gi python3-numpy python3-wheel python3-watchdog ofono patchelf rpm2cpio sudo libcap2-bin python3-pip udhcpc iperf3 locales
#9 CACHED
#10 [ 7/28] RUN APT-GET update && apt-get install -y openssh-server
#10 CACHED
#11 [ 4/28] RUN usermod -a -G osmo-gsm-tester jenkins
#11 CACHED
#12 [11/28] RUN chmod -R 0700 /home/jenkins/.ssh /root/.ssh
#12 CACHED
#13 [ 6/28] RUN PIP3 install --break-system-packages "git+https://github.com/podshumok/python-smpplib.git@master#egg=smpplib" pydbus pyusb pysispm pymongo
#13 CACHED
#14 [10/28] COPY --CHOWN=JENKINS:JENKINS ssh /home/jenkins/.ssh
#14 CACHED
#15 [15/28] RUN APT-GET update && apt-get install -y --no-install-recommends telnet libosmocore-dev libosmo-abis-dev libosmo-gsup-client-dev libosmo-netif-dev libosmo-ranap-dev libosmo-sigtran-dev libsmpp34-dev libgtp-dev libasn1c-dev && apt-get clean
#15 CACHED
#16 [14/28] RUN sed -i -e 's/# en_US.UTF-8 UTF-8/en_US.UTF-8 UTF-8/' /etc/locale.gen && dpkg-reconfigure --frontend=noninteractive locales && update-locale LANG=en_US.UTF-8
#16 CACHED
#17 [13/28] RUN CHOWN -R jenkins:jenkins /osmo-gsm-tester-*
#17 CACHED
#18 [16/28] RUN APT-GET update && apt-get install -y --no-install-recommends cmake libfftw3-dev libmbedtls-dev libboost-program-options-dev libconfig++-dev libsctp-dev libpcsclite-dev libuhd-dev libczmq-dev libsoapysdr-dev soapysdr-module-lms7 && apt-get clean
#18 CACHED
#19 [ 8/28] RUN MKDIR /var/run/sshd
#19 CACHED
#20 [ 9/28] COPY SSH /root/.ssh
#20 CACHED
#21 [ 2/28] RUN useradd -ms /bin/bash jenkins
#21 CACHED
#22 [17/28] RUN APT-GET update && apt-get install -y --no-install-recommends gnuradio && apt-get clean
#22 CACHED
#23 [18/28] RUN SET -x && mkdir -p /tmp/mongodb && cd /tmp/mongodb && wget "https://pgp.mongodb.com/server-5.0.asc" -O "/mongodb.key" && wget "http://security.debian.org/debian-security/pool/updates/main/o/openssl/libssl1.1_1.1.1n-0+deb10u6_amd64.deb" && dpkg -i "libssl1.1_1.1.1n-0+deb10u6_amd64.deb" && echo "deb [signed-by=/mongodb.key] http://repo.mongodb.org/apt/debian bullseye/mongodb-org/5.0 main" > /etc/apt/sources.list.d/mongodb-org.list && apt-get update && apt-get install -y mongodb-org && apt-get clean && cd / && rm -rf /tmp/mongodb && rm /etc/apt/sources.list.d/mongodb-org.list && sed -i "s/127.0.0.1/172.18.50.2/g" /etc/mongod.conf
#23 0.292 + mkdir -p /tmp/mongodb
#23 0.294 + cd /tmp/mongodb
#23 0.294 + wget https://pgp.mongodb.com/server-5.0.asc -O /mongodb.key
#23 0.297 --2025-07-29 10:56:20-- https://pgp.mongodb.com/server-5.0.asc
#23 0.302 Resolving pgp.mongodb.com (pgp.mongodb.com)... 99.84.152.66, 99.84.152.50, 99.84.152.76, ...
#23 0.376 Connecting to pgp.mongodb.com (pgp.mongodb.com)|99.84.152.66|:443... connected.
#23 0.398 HTTP request sent, awaiting response... 200 OK
#23 0.704 Length: 1656 (1.6K) [binary/octet-stream]
#23 0.704 Saving to: ‘/mongodb.key’
#23 0.704
#23 0.704 0K . 100% 83.7M=0s
#23 0.704
#23 0.704 2025-07-29 10:56:20 (83.7 MB/s) - ‘/mongodb.key’ saved [1656/1656]
#23 0.704
#23 0.706 + wget http://security.debian.org/debian-security/pool/updates/main/o/openssl/libssl1.1_1.1.1n-0+deb10u6_amd64.deb
#23 0.712 --2025-07-29 10:56:20-- http://security.debian.org/debian-security/pool/updates/main/o/openssl/libssl1.1_1.1.1n-0+deb10u6_amd64.deb
#23 0.712 Resolving security.debian.org (security.debian.org)... 151.101.2.132, 151.101.194.132, 151.101.66.132, ...
#23 0.712 Connecting to security.debian.org (security.debian.org)|151.101.2.132|:80... connected.
#23 0.717 HTTP request sent, awaiting response... 404 Not Found
#23 0.732 2025-07-29 10:56:20 ERROR 404: Not Found.
#23 0.732
#23 ERROR: process "/bin/sh -c set -x && \tmkdir -p /tmp/mongodb && \tcd /tmp/mongodb && \twget \"https://pgp.mongodb.com/server-5.0.asc\" -O \"/mongodb.key\" && \twget \"http://security.debian.org/debian-security/pool/updates/main/o/openssl/libssl1.1_1.1.1n-0+deb10u6_amd64.deb\" && \tdpkg -i \"libssl1.1_1.1.1n-0+deb10u6_amd64.deb\" && \techo \"deb [signed-by=/mongodb.key] http://repo.mongodb.org/apt/debian bullseye/mongodb-org/5.0 main\" \t\t> /etc/apt/sources.list.d/mongodb-org.list && \tapt-get update && \tapt-get install -y mongodb-org && \tapt-get clean && \tcd / && \trm -rf /tmp/mongodb && \trm /etc/apt/sources.list.d/mongodb-org.list && \tsed -i \"s/127.0.0.1/$OGT_MASTER_ADDR/g\" /etc/mongod.conf" did not complete successfully: exit code: 8
------
> [18/28] RUN SET -x && mkdir -p /tmp/mongodb && cd /tmp/mongodb && wget "https://pgp.mongodb.com/server-5.0.asc" -O "/mongodb.key" && wget "http://security.debian.org/debian-security/pool/updates/main/o/openssl/libssl1.1_1.1.1n-0+deb10u6_amd64.deb" && dpkg -i "libssl1.1_1.1.1n-0+deb10u6_amd64.deb" && echo "deb [signed-by=/mongodb.key] http://repo.mongodb.org/apt/debian bullseye/mongodb-org/5.0 main" > /etc/apt/sources.list.d/mongodb-org.list && apt-get update && apt-get install -y mongodb-org && apt-get clean && cd / && rm -rf /tmp/mongodb && rm /etc/apt/sources.list.d/mongodb-org.list && sed -i "s/127.0.0.1/172.18.50.2/g" /etc/mongod.conf:
0.704
0.704 2025-07-29 10:56:20 (83.7 MB/s) - ‘/mongodb.key’ saved [1656/1656]
0.704
0.706 + wget http://security.debian.org/debian-security/pool/updates/main/o/openssl/libssl1.1_1.1.1n-0+deb10u6_amd64.deb
0.712 --2025-07-29 10:56:20-- http://security.debian.org/debian-security/pool/updates/main/o/openssl/libssl1.1_1.1.1n-0+deb10u6_amd64.deb
0.712 Resolving security.debian.org (security.debian.org)... 151.101.2.132, 151.101.194.132, 151.101.66.132, ...
0.712 Connecting to security.debian.org (security.debian.org)|151.101.2.132|:80... connected.
0.717 HTTP request sent, awaiting response... 404 Not Found
0.732 2025-07-29 10:56:20 ERROR 404: Not Found.
0.732
------
[33m2 warnings found (use docker --debug to expand):
[0m - InvalidDefaultArgInFrom: Default value for ARG $USER/debian-bookworm-build results in empty or invalid base image name (line 2)
- LegacyKeyValueFormat: "ENV key=value" should be used instead of legacy "ENV key value" format (line 65)
Dockerfile:105
--------------------
104 | # package is not available. Furthermore, manually install required libssl1.1.
105 | >>> RUN set -x && \
106 | >>> mkdir -p /tmp/mongodb && \
107 | >>> cd /tmp/mongodb && \
108 | >>> wget "https://pgp.mongodb.com/server-5.0.asc" -O "/mongodb.key" && \
109 | >>> wget "http://security.debian.org/debian-security/pool/updates/main/o/openssl/libssl1.1_1.1.1n-0+deb10u6_amd64.deb" && \
110 | >>> dpkg -i "libssl1.1_1.1.1n-0+deb10u6_amd64.deb" && \
111 | >>> echo "deb [signed-by=/mongodb.key] http://repo.mongodb.org/apt/debian bullseye/mongodb-org/5.0 main" \
112 | >>> > /etc/apt/sources.list.d/mongodb-org.list && \
113 | >>> apt-get update && \
114 | >>> apt-get install -y mongodb-org && \
115 | >>> apt-get clean && \
116 | >>> cd / && \
117 | >>> rm -rf /tmp/mongodb && \
118 | >>> rm /etc/apt/sources.list.d/mongodb-org.list && \
119 | >>> sed -i "s/127.0.0.1/$OGT_MASTER_ADDR/g" /etc/mongod.conf
120 |
--------------------
ERROR: failed to solve: process "/bin/sh -c set -x && \tmkdir -p /tmp/mongodb && \tcd /tmp/mongodb && \twget \"https://pgp.mongodb.com/server-5.0.asc\" -O \"/mongodb.key\" && \twget \"http://security.debian.org/debian-security/pool/updates/main/o/openssl/libssl1.1_1.1.1n-0+deb10u6_amd64.deb\" && \tdpkg -i \"libssl1.1_1.1.1n-0+deb10u6_amd64.deb\" && \techo \"deb [signed-by=/mongodb.key] http://repo.mongodb.org/apt/debian bullseye/mongodb-org/5.0 main\" \t\t> /etc/apt/sources.list.d/mongodb-org.list && \tapt-get update && \tapt-get install -y mongodb-org && \tapt-get clean && \tcd / && \trm -rf /tmp/mongodb && \trm /etc/apt/sources.list.d/mongodb-org.list && \tsed -i \"s/127.0.0.1/$OGT_MASTER_ADDR/g\" /etc/mongod.conf" did not complete successfully: exit code: 8
make: *** [../make/Makefile:95: docker-build] Error 1
make: Leaving directory '<https://jenkins.osmocom.org/jenkins/job/osmo-gsm-tester_build-osmo-msc/ws/docker-playground/osmo-gsm-tester'>
Build step 'Execute shell' marked build as failure
Skipped archiving because build is not successful
See <https://jenkins.osmocom.org/jenkins/job/osmo-gsm-tester_build-osmo-msc/39988/display/redirect> Changes: ------------------------------------------ [...truncated 124.02 KiB...] #22 40.88 update-alternatives: using /usr/lib/x86_64-linux-gnu/openblas-pthread/liblapack.so.3 to provide /usr/lib/x86_64-linux-gnu/liblapack.so.3 (liblapack.so.3-x86_64-linux-gnu) in auto mode #22 40.89 update-alternatives: using /usr/lib/x86_64-linux-gnu/openblas-pthread/libopenblas.so.0 to provide /usr/lib/x86_64-linux-gnu/libopenblas.so.0 (libopenblas.so.0-x86_64-linux-gnu) in auto mode #22 40.92 Setting up libmpg123-0:amd64 (1.31.2-1+deb12u1) ... #22 40.97 Setting up libxcb-xfixes0:amd64 (1.15-1) ... #22 41.04 Setting up libogg0:amd64 (1.3.5-3) ... #22 41.09 Setting up python3-cairo:amd64 (1.20.1-5+b1) ... #22 41.21 Setting up hicolor-icon-theme (0.17-2) ... #22 41.35 Setting up libjs-mathjax (2.7.9+dfsg-1) ... #22 41.43 Setting up libxcb-xinput0:amd64 (1.15-1) ... #22 41.47 Setting up libvte-2.91-common (0.70.6-2~deb12u1) ... #22 41.56 Setting up libgslcblas0:amd64 (2.7.1+dfsg-5+deb12u1) ... #22 41.66 Setting up python3-colorama (0.4.6-2) ... #22 41.80 Setting up libglvnd0:amd64 (1.6.0-1) ... #22 41.85 Setting up libxcb-glx0:amd64 (1.15-1) ... #22 41.90 Setting up python3-ply (3.11-5) ... #22 42.03 Setting up libiio0:amd64 (0.24-4) ... #22 42.08 Setting up libxcb-keysyms1:amd64 (0.4.0-1+b2) ... #22 42.13 Setting up libxcb-shape0:amd64 (1.15-1) ... #22 42.19 Setting up python3-gast (0.5.2-2) ... #22 42.33 Setting up libgsl27:amd64 (2.7.1+dfsg-5+deb12u1) ... #22 42.45 Setting up libxcb-render-util0:amd64 (0.3.9-1+b1) ... #22 42.52 Setting up python3-all (3.11.2-1+b1) ... #22 42.57 Setting up xkb-data (2.35.1-1) ... #22 42.63 Setting up python3-contextlib2 (0.6.0.post1-3) ... #22 42.79 Setting up libxcb-icccm4:amd64 (0.4.1-1.1) ... #22 42.86 Setting up libatspi2.0-0:amd64 (2.46.0-5) ... #22 42.93 Setting up python3-click (8.1.3-2) ... #22 43.08 Setting up libqt6core6:amd64 (6.4.2+dfsg-10) ... #22 43.13 Setting up libunwind8:amd64 (1.6.2-3) ... #22 43.20 Setting up python3-thrift (0.17.0-2+b2) ... #22 43.32 Setting up libts0:amd64 (1.22-1+b1) ... #22 43.39 Setting up libcolord2:amd64 (1.4.6-2.2) ... #22 43.45 Setting up gnome-terminal-data (3.46.8-1) ... #22 43.50 Setting up libopengl0:amd64 (1.6.0-1) ... #22 43.55 Setting up libxcb-util1:amd64 (0.4.0-1+b1) ... #22 43.60 Setting up libxxf86vm1:amd64 (1:1.1.4-1+b2) ... #22 43.65 Setting up libxcb-xkb1:amd64 (1.15-1) ... #22 43.70 Setting up libxcb-image0:amd64 (0.4.0-2) ... #22 43.75 Setting up libxcb-present0:amd64 (1.15-1) ... #22 43.79 Setting up libdconf1:amd64 (0.40.0-4) ... #22 43.84 Setting up python3-beniget (0.4.1-3) ... #22 43.97 Setting up libxsimd-dev:amd64 (8.1.0-7) ... #22 44.02 Setting up python3-decorator (5.1.1-3) ... #22 44.15 Setting up libxcb-xinerama0:amd64 (1.15-1) ... #22 44.20 Setting up libflac12:amd64 (1.4.2+ds-2) ... #22 44.25 Setting up libslang2:amd64 (2.3.3-3) ... #22 44.30 Setting up libqt6xml6:amd64 (6.4.2+dfsg-10) ... #22 44.34 Setting up adwaita-icon-theme (43-1) ... #22 44.41 update-alternatives: using /usr/share/icons/Adwaita/cursor.theme to provide /usr/share/icons/default/index.theme (x-cursor-theme) in auto mode #22 44.43 Setting up libqt6sql6:amd64 (6.4.2+dfsg-10) ... #22 44.48 Setting up libepoxy0:amd64 (1.5.10-1) ... #22 44.53 Setting up libxfixes3:amd64 (1:6.0.0-2) ... #22 44.58 Setting up libxcb-sync1:amd64 (1.15-1) ... #22 44.63 Setting up libpython3-all-dev:amd64 (3.11.2-1+b1) ... #22 44.70 Setting up libopus0:amd64 (1.3.1-3) ... #22 44.75 Setting up libxinerama1:amd64 (2:1.1.4-3) ... #22 44.80 Setting up libvorbis0a:amd64 (1.3.7-1) ... #22 44.85 Setting up castxml (0.5.1-1) ... #22 44.90 Setting up libxrandr2:amd64 (2:1.5.2-2+b1) ... #22 44.98 Setting up liborc-0.4-0:amd64 (1:0.4.33-2) ... #22 45.03 Setting up python3-click-plugins (1.1.1-4) ... #22 45.14 Setting up libqt5core5a:amd64 (5.15.8+dfsg-11+deb12u3) ... #22 45.20 Setting up libglapi-mesa:amd64 (22.3.6-1+deb12u1) ... #22 45.25 Setting up libmtdev1:amd64 (1.1.6-1) ... #22 45.30 Setting up libfmt9:amd64 (9.1.0+ds1-2) ... #22 45.36 Setting up libxcb-dri2-0:amd64 (1.15-1) ... #22 45.41 Setting up python3-pyqt5.sip (12.11.1-1) ... #22 45.46 Setting up python3-pyrsistent:amd64 (0.18.1-1+b3) ... #22 45.60 Setting up libopenblas0:amd64 (0.3.21+ds-4) ... #22 45.65 Setting up libasyncns0:amd64 (0.8-6+b3) ... #22 45.71 Setting up libxshmfence1:amd64 (1.3-1) ... #22 45.76 Setting up python3-lxml:amd64 (4.9.2-1+b1) ... #22 45.91 Setting up at-spi2-common (2.46.0-5) ... #22 45.98 Setting up libqt5dbus5:amd64 (5.15.8+dfsg-11+deb12u3) ... #22 46.03 Setting up python3-schema (0.7.5-1) ... #22 46.17 Setting up libxcb-randr0:amd64 (1.15-1) ... #22 46.22 Setting up libllvm15:amd64 (1:15.0.6-4+b1) ... #22 46.27 Setting up libmd4c0:amd64 (0.4.8-1) ... #22 46.32 Setting up libatk1.0-0:amd64 (2.46.0-5) ... #22 46.37 Setting up libglu1-mesa:amd64 (9.0.2-1.1) ... #22 46.42 Setting up libwayland-egl1:amd64 (1.21.0-1) ... #22 46.48 Setting up python3-pygccxml (2.2.1-1) ... #22 46.65 Setting up python3-pyqt6.sip (13.4.1-1) ... #22 46.69 Setting up libsamplerate0:amd64 (0.2.2-3) ... #22 46.74 Setting up libqt5test5:amd64 (5.15.8+dfsg-11+deb12u3) ... #22 46.79 Setting up python3-gi-cairo (3.42.2-3+b1) ... #22 46.84 Setting up libdrm-common (2.4.114-1) ... #22 46.88 Setting up libxcomposite1:amd64 (1:0.4.5-1) ... #22 46.94 Setting up libevdev2:amd64 (1.13.0+dfsg-1) ... #22 46.99 Setting up libgudev-1.0-0:amd64 (237-2) ... #22 47.04 Setting up qtchooser (66-2) ... #22 47.09 Setting up libmp3lame0:amd64 (3.100-6) ... #22 47.14 Setting up python3-cffi-backend:amd64 (1.15.1-5+b1) ... #22 47.18 Setting up libvorbisenc2:amd64 (1.3.7-1) ... #22 47.23 Setting up libqt6dbus6:amd64 (6.4.2+dfsg-10) ... #22 47.28 Setting up liblbfgsb0:amd64 (3.0+dfsg.4-1) ... #22 47.33 Setting up libwacom-common (2.6.0-1) ... #22 47.37 Setting up python3-sip (4.19.25+dfsg-5+b1) ... #22 47.49 Setting up libxkbcommon0:amd64 (1.5.0-1) ... #22 47.54 Setting up libwayland-client0:amd64 (1.21.0-1) ... #22 47.58 Setting up libspdlog1.10:amd64 (1:1.10.0+ds-0.4) ... #22 47.63 Setting up libopenblas-pthread-dev:amd64 (0.3.21+ds-4) ... #22 47.67 update-alternatives: using /usr/lib/x86_64-linux-gnu/openblas-pthread/libblas.so to provide /usr/lib/x86_64-linux-gnu/libblas.so (libblas.so-x86_64-linux-gnu) in auto mode #22 47.68 update-alternatives: using /usr/lib/x86_64-linux-gnu/openblas-pthread/liblapack.so to provide /usr/lib/x86_64-linux-gnu/liblapack.so (liblapack.so-x86_64-linux-gnu) in auto mode #22 47.68 update-alternatives: using /usr/lib/x86_64-linux-gnu/openblas-pthread/libopenblas.so to provide /usr/lib/x86_64-linux-gnu/libopenblas.so (libopenblas.so-x86_64-linux-gnu) in auto mode #22 47.71 Setting up python3-all-dev (3.11.2-1+b1) ... #22 47.76 Setting up libqt6test6:amd64 (6.4.2+dfsg-10) ... #22 47.80 Setting up libad9361-0:amd64 (0.2-1) ... #22 47.85 Setting up libcaca0:amd64 (0.99.beta20-3) ... #22 47.90 Setting up qt6-base-dev-tools (6.4.2+dfsg-10) ... #22 47.95 Setting up libwacom9:amd64 (2.6.0-1) ... #22 48.01 Setting up libxcursor1:amd64 (1:1.2.1-1) ... #22 48.06 Setting up dconf-service (0.40.0-4) ... #22 48.11 Setting up libqt5network5:amd64 (5.15.8+dfsg-11+deb12u3) ... #22 48.16 Setting up libinput-bin (1.22.1-1) ... #22 48.21 Setting up libqt5sql5:amd64 (5.15.8+dfsg-11+deb12u3) ... #22 48.26 Setting up libatk-bridge2.0-0:amd64 (2.46.0-5) ... #22 48.31 Setting up qtbase5-dev-tools (5.15.8+dfsg-11+deb12u3) ... #22 48.36 Setting up libopenblas-dev:amd64 (0.3.21+ds-4) ... #22 48.41 Setting up libqt5xml5:amd64 (5.15.8+dfsg-11+deb12u3) ... #22 48.46 Setting up python3-jsonschema (4.10.3-1) ... #22 48.61 Setting up python3-zmq (24.0.1-4+b1) ... #22 48.78 Setting up libxkbcommon-x11-0:amd64 (1.5.0-1) ... #22 48.83 Setting up libvolk2.5:amd64 (2.5.2-3) ... #22 48.87 Setting up libjack-jackd2-0:amd64 (1.9.21~dfsg-3) ... #22 48.92 Setting up libdrm2:amd64 (2.4.114-1+b1) ... #22 48.97 Setting up python3-pythran (0.11.0+ds-7) ... #22 49.20 Setting up libwayland-cursor0:amd64 (1.21.0-1) ... #22 49.24 Setting up libqt6network6:amd64 (6.4.2+dfsg-10) ... #22 49.30 Setting up libgnuradio-pmt3.10.5:amd64 (3.10.5.1-3) ... #22 49.35 Setting up libsndfile1:amd64 (1.2.0-1) ... #22 49.39 Setting up libdrm-amdgpu1:amd64 (2.4.114-1+b1) ... #22 49.44 Setting up libinput10:amd64 (1.22.1-1) ... #22 49.49 Setting up libportaudio2:amd64 (19.6.0-1.2) ... #22 49.54 Setting up libdrm-nouveau2:amd64 (2.4.114-1+b1) ... #22 49.59 Setting up python3-scipy (1.10.1-2) ... #22 50.87 Setting up libvolk2-bin (2.5.2-3) ... #22 50.99 Setting up dconf-gsettings-backend:amd64 (0.40.0-4) ... #22 51.04 Setting up libgbm1:amd64 (22.3.6-1+deb12u1) ... #22 51.09 Setting up libpulse0:amd64 (16.1+dfsg1-2+b1) ... #22 51.15 Setting up libdrm-radeon1:amd64 (2.4.114-1+b1) ... #22 51.20 Setting up libdrm-intel1:amd64 (2.4.114-1+b1) ... #22 51.25 Setting up libgl1-mesa-dri:amd64 (22.3.6-1+deb12u1) ... #22 51.30 Setting up libthrift-0.17.0:amd64 (0.17.0-2+b2) ... #22 51.35 Setting up libegl-mesa0:amd64 (22.3.6-1+deb12u1) ... #22 51.41 Setting up libsdl1.2debian:amd64 (1.2.15+dfsg2-8) ... #22 51.46 Setting up libegl1:amd64 (1.6.0-1) ... #22 51.51 Setting up libgnuradio-runtime3.10.5:amd64 (3.10.5.1-3) ... #22 51.56 Setting up libgtk-3-common (3.24.38-2~deb12u3) ... #22 51.62 Setting up gsettings-desktop-schemas (43.0-1) ... #22 51.67 Setting up libgnuradio-blocks3.10.5:amd64 (3.10.5.1-3) ... #22 51.72 Setting up libgnuradio-trellis3.10.5:amd64 (3.10.5.1-3) ... #22 51.77 Setting up libglx-mesa0:amd64 (22.3.6-1+deb12u1) ... #22 51.81 Setting up libgnuradio-vocoder3.10.5:amd64 (3.10.5.1-3) ... #22 51.88 Setting up libgnuradio-iio3.10.5:amd64 (3.10.5.1-3) ... #22 51.94 Setting up libglx0:amd64 (1.6.0-1) ... #22 51.99 Setting up libgnuradio-fec3.10.5:amd64 (3.10.5.1-3) ... #22 52.05 Setting up libgnuradio-pdu3.10.5:amd64 (3.10.5.1-3) ... #22 52.10 Setting up libgnuradio-uhd3.10.5:amd64 (3.10.5.1-3) ... #22 52.16 Setting up libgnuradio-network3.10.5:amd64 (3.10.5.1-3) ... #22 52.21 Setting up libgnuradio-video-sdl3.10.5:amd64 (3.10.5.1-3) ... #22 52.29 Setting up libgl1:amd64 (1.6.0-1) ... #22 52.33 Setting up libqt6gui6:amd64 (6.4.2+dfsg-10) ... #22 52.38 Setting up libgnuradio-fft3.10.5:amd64 (3.10.5.1-3) ... #22 52.43 Setting up libgnuradio-filter3.10.5:amd64 (3.10.5.1-3) ... #22 52.48 Setting up libgnuradio-soapy3.10.5:amd64 (3.10.5.1-3) ... #22 52.53 Setting up libgnuradio-wavelet3.10.5:amd64 (3.10.5.1-3) ... #22 52.58 Setting up libgl1-mesa-glx:amd64 (22.3.6-1+deb12u1) ... #22 52.63 Setting up libgnuradio-audio3.10.5:amd64 (3.10.5.1-3) ... #22 52.68 Setting up libgnuradio-zeromq3.10.5:amd64 (3.10.5.1-3) ... #22 52.73 Setting up libgnuradio-dtv3.10.5:amd64 (3.10.5.1-3) ... #22 52.79 Setting up libqt5gui5:amd64 (5.15.8+dfsg-11+deb12u3) ... #22 52.87 Setting up libqt6opengl6:amd64 (6.4.2+dfsg-10) ... #22 52.91 Setting up libgnuradio-analog3.10.5:amd64 (3.10.5.1-3) ... #22 52.96 Setting up libqt5widgets5:amd64 (5.15.8+dfsg-11+deb12u3) ... #22 53.01 Setting up python3-opengl (3.1.6+dfsg-3) ... #22 53.68 Setting up libqt5help5:amd64 (5.15.8-2) ... #22 53.73 Setting up libgnuradio-digital3.10.5:amd64 (3.10.5.1-3) ... #22 53.78 Setting up libqt6widgets6:amd64 (6.4.2+dfsg-10) ... #22 53.82 Setting up libqt5printsupport5:amd64 (5.15.8+dfsg-11+deb12u3) ... #22 53.87 Setting up libqt5opengl5:amd64 (5.15.8+dfsg-11+deb12u3) ... #22 53.92 Setting up libqt6openglwidgets6:amd64 (6.4.2+dfsg-10) ... #22 53.97 Setting up libgnuradio-channels3.10.5:amd64 (3.10.5.1-3) ... #22 54.01 Setting up libqt6printsupport6:amd64 (6.4.2+dfsg-10) ... #22 54.06 Setting up libqt5designer5:amd64 (5.15.8-2) ... #22 54.11 Setting up python3-pyqt6 (6.4.2-1) ... #22 54.22 Setting up pyqt6-dev-tools (6.4.2-1) ... #22 54.35 Setting up libqt5svg5:amd64 (5.15.8-3) ... #22 54.40 Setting up libqwt-qt5-6 (6.1.4-2) ... #22 54.45 Setting up libgnuradio-qtgui3.10.5:amd64 (3.10.5.1-3) ... #22 54.50 Setting up python3-pyqt5 (5.15.9+dfsg-1) ... #22 54.62 Setting up pyqt5-dev-tools (5.15.9+dfsg-1) ... #22 54.73 Setting up python3-pyqtgraph (0.13.1-4) ... #22 55.11 Processing triggers for libc-bin (2.36-9+deb12u10) ... #22 55.16 Processing triggers for man-db (2.11.2-2) ... #22 55.21 Processing triggers for shared-mime-info (2.2-1) ... #22 63.22 Processing triggers for mailcap (3.70+nmu1) ... #22 63.27 Processing triggers for fontconfig (2.14.1-4) ... #22 63.48 Processing triggers for libglib2.0-0:amd64 (2.74.6-2+deb12u6) ... #22 63.56 Setting up libgtk-3-0:amd64 (3.24.38-2~deb12u3) ... #22 63.64 Setting up libvte-2.91-0:amd64 (0.70.6-2~deb12u1) ... #22 63.70 Setting up gnome-terminal (3.46.8-1) ... #22 63.74 update-alternatives: using /usr/bin/gnome-terminal.wrapper to provide /usr/bin/x-terminal-emulator (x-terminal-emulator) in auto mode #22 63.74 update-alternatives: warning: skip creation of /usr/share/man/man1/x-terminal-emulator.1.gz because associated file /usr/share/man/man1/gnome-terminal.1.gz (of link group x-terminal-emulator) doesn't exist #22 63.78 Setting up gnuradio (3.10.5.1-3) ... #22 64.31 Processing triggers for libc-bin (2.36-9+deb12u10) ... #22 DONE 64.5s #23 [18/28] RUN SET -x && mkdir -p /tmp/mongodb && cd /tmp/mongodb && wget "https://pgp.mongodb.com/server-5.0.asc" -O "/mongodb.key" && wget "http://security.debian.org/debian-security/pool/updates/main/o/openssl/libss..." && dpkg -i "libssl1.1_1.1.1n-0+deb10u6_amd64.deb" && echo "deb [signed-by=/mongodb.key] http://repo.mongodb.org/apt/debian bullseye/mongodb-org/5.0 main" > /etc/apt/sources.list.d/mongodb-org.list && apt-get update && apt-get install -y mongodb-org && apt-get clean && cd / && rm -rf /tmp/mongodb && rm /etc/apt/sources.list.d/mongodb-org.list && sed -i "s/127.0.0.1/172.18.50.2/g" /etc/mongod.conf #23 0.336 + mkdir -p /tmp/mongodb #23 0.336 + cd /tmp/mongodb #23 0.336 + wget https://pgp.mongodb.com/server-5.0.asc -O /mongodb.key #23 0.338 --2025-07-29 13:26:22-- https://pgp.mongodb.com/server-5.0.asc #23 0.345 Resolving pgp.mongodb.com (pgp.mongodb.com)... 99.84.152.69, 99.84.152.66, 99.84.152.76, ... #23 0.430 Connecting to pgp.mongodb.com (pgp.mongodb.com)|99.84.152.69|:443... connected. #23 0.452 HTTP request sent, awaiting response... 200 OK #23 0.757 Length: 1656 (1.6K) [binary/octet-stream] #23 0.757 Saving to: ‘/mongodb.key’ #23 0.757 #23 0.757 0K . 100% 20.2M=0s #23 0.758 #23 0.758 2025-07-29 13:26:22 (20.2 MB/s) - ‘/mongodb.key’ saved [1656/1656] #23 0.758 #23 0.759 + wget http://security.debian.org/debian-security/pool/updates/main/o/openssl/libss... #23 0.764 --2025-07-29 13:26:22-- http://security.debian.org/debian-security/pool/updates/main/o/openssl/libss... #23 0.764 Resolving security.debian.org (security.debian.org)... 151.101.130.132, 151.101.2.132, 151.101.194.132, ... #23 0.764 Connecting to security.debian.org (security.debian.org)|151.101.130.132|:80... connected. #23 0.769 HTTP request sent, awaiting response... 404 Not Found #23 0.780 2025-07-29 13:26:22 ERROR 404: Not Found. #23 0.780 #23 ERROR: process "/bin/sh -c set -x && \tmkdir -p /tmp/mongodb && \tcd /tmp/mongodb && \twget \"https://pgp.mongodb.com/server-5.0.asc\" -O \"/mongodb.key\" && \twget \"http://security.debian.org/debian-security/pool/updates/main/o/openssl/libssl1.1_1.1.1n-0+deb10u6_amd64.deb\" && \tdpkg -i \"libssl1.1_1.1.1n-0+deb10u6_amd64.deb\" && \techo \"deb [signed-by=/mongodb.key] http://repo.mongodb.org/apt/debian bullseye/mongodb-org/5.0 main\" \t\t> /etc/apt/sources.list.d/mongodb-org.list && \tapt-get update && \tapt-get install -y mongodb-org && \tapt-get clean && \tcd / && \trm -rf /tmp/mongodb && \trm /etc/apt/sources.list.d/mongodb-org.list && \tsed -i \"s/127.0.0.1/$OGT_MASTER_ADDR/g\" /etc/mongod.conf" did not complete successfully: exit code: 8 ------
[18/28] RUN SET -x && mkdir -p /tmp/mongodb && cd /tmp/mongodb && wget "https://pgp.mongodb.com/server-5.0.asc" -O "/mongodb.key" && wget "http://security.debian.org/debian-security/pool/updates/main/o/openssl/libss..." && dpkg -i "libssl1.1_1.1.1n-0+deb10u6_amd64.deb" && echo "deb [signed-by=/mongodb.key] http://repo.mongodb.org/apt/debian bullseye/mongodb-org/5.0 main" > /etc/apt/sources.list.d/mongodb-org.list && apt-get update && apt-get install -y mongodb-org && apt-get clean && cd / && rm -rf /tmp/mongodb && rm /etc/apt/sources.list.d/mongodb-org.list && sed -i "s/127.0.0.1/172.18.50.2/g" /etc/mongod.conf: 0.758 0.758 2025-07-29 13:26:22 (20.2 MB/s) - ‘/mongodb.key’ saved [1656/1656] 0.758 0.759 + wget http://security.debian.org/debian-security/pool/updates/main/o/openssl/libss... 0.764 --2025-07-29 13:26:22-- http://security.debian.org/debian-security/pool/updates/main/o/openssl/libss... 0.764 Resolving security.debian.org (security.debian.org)... 151.101.130.132, 151.101.2.132, 151.101.194.132, ... 0.764 Connecting to security.debian.org (security.debian.org)|151.101.130.132|:80... connected. 0.769 HTTP request sent, awaiting response... 404 Not Found 0.780 2025-07-29 13:26:22 ERROR 404: Not Found. 0.780
ERROR: failed to solve: process "/bin/sh -c set -x && \tmkdir -p /tmp/mongodb && \tcd /tmp/mongodb && \twget \"https://pgp.mongodb.com/server-5.0.asc\" -O \"/mongodb.key\" && \twget \"http://security.debian.org/debian-security/pool/updates/main/o/openssl/libssl1.1_1.1.1n-0+deb10u6_amd64.deb\" && \tdpkg -i \"libssl1.1_1.1.1n-0+deb10u6_amd64.deb\" && \techo \"deb [signed-by=/mongodb.key] http://repo.mongodb.org/apt/debian bullseye/mongodb-org/5.0 main\" \t\t> /etc/apt/sources.list.d/mongodb-org.list && \tapt-get update && \tapt-get install -y mongodb-org && \tapt-get clean && \tcd / && \trm -rf /tmp/mongodb && \trm /etc/apt/sources.list.d/mongodb-org.list && \tsed -i \"s/127.0.0.1/$OGT_MASTER_ADDR/g\" /etc/mongod.conf" did not complete successfully: exit code: 8 make: *** [../make/Makefile:96: docker-build] Error 1 make: Leaving directory '<https://jenkins.osmocom.org/jenkins/job/osmo-gsm-tester_build-osmo-msc/ws/docker-playground/osmo-gsm-tester'> Build step 'Execute shell' marked build as failure Skipped archiving because build is not successful
See <https://jenkins.osmocom.org/jenkins/job/osmo-gsm-tester_build-osmo-msc/39989/display/redirect>
Changes:
------------------------------------------
Started by upstream project "master-osmo-msc" build number 48812
originally caused by:
Started by upstream project "master-osmo-iuh" build number 18569
originally caused by:
Started by upstream project "master-libosmo-sigtran" build number 636
originally caused by:
Started by timer
Running as SYSTEM
Building remotely on build4-deb12build-ansible (registry-build-amd64 ttcn3 obs osmo-gsm-tester-build ttcn3_with_linux_6.1_or_higher qemu io_uring osmocom-gerrit coverity osmocom-master) in workspace <https://jenkins.osmocom.org/jenkins/job/osmo-gsm-tester_build-osmo-msc/ws/>
The recommended git tool is: NONE
No credentials specified
> git rev-parse --resolve-git-dir <https://jenkins.osmocom.org/jenkins/job/osmo-gsm-tester_build-osmo-msc/ws/osmo-gsm-tester/.git> # timeout=10
Fetching changes from the remote Git repository
> git config remote.origin.url https://gerrit.osmocom.org/osmo-gsm-tester # timeout=10
Fetching upstream changes from https://gerrit.osmocom.org/osmo-gsm-tester
> git --version # timeout=10
> git --version # 'git version 2.39.5'
> git fetch --tags --force --progress -- https://gerrit.osmocom.org/osmo-gsm-tester +refs/heads/*:refs/remotes/origin/* # timeout=10
> git rev-parse origin/master^{commit} # timeout=10
Checking out Revision f7d64b0bcf946ec21ce9c7562194343a12213a80 (origin/master)
> git config core.sparsecheckout # timeout=10
> git checkout -f f7d64b0bcf946ec21ce9c7562194343a12213a80 # timeout=10
Commit message: "jenkins.sh: libosmo-netif no longer depends on libosmo-abis"
> git rev-list --no-walk f7d64b0bcf946ec21ce9c7562194343a12213a80 # timeout=10
[osmo-gsm-tester_build-osmo-msc] $ /bin/sh -xe /tmp/jenkins11265215442082466038.sh
+ rm -rf docker-playground
+ git clone --depth=1 --branch=master https://gerrit.osmocom.org/docker-playground docker-playground
Cloning into 'docker-playground'...
+ git -C docker-playground log --oneline
1e8a5be Makefile: add missing OSMO_S1GW_BRANCH
+ make -C docker-playground/osmo-gsm-tester
make: Entering directory '<https://jenkins.osmocom.org/jenkins/job/osmo-gsm-tester_build-osmo-msc/ws/docker-playground/osmo-gsm-tester'>
awk: fatal: cannot open file `.release' for reading: No such file or directory
awk: fatal: cannot open file `.release' for reading: No such file or directory
awk: fatal: cannot open file `.release' for reading: No such file or directory
rm -rf .common
cp -r <https://jenkins.osmocom.org/jenkins/job/osmo-gsm-tester_build-osmo-msc/ws/docker-playground/common> .common
INFO: .release created
release=0.0.0
docker build \
--build-arg USER=osmocom-build \
--build-arg UID=1000 \
--build-arg REGISTRY=docker.io \
--build-arg OSMO_TTCN3_BRANCH=master \
--build-arg UPSTREAM_DISTRO=debian:bookworm \
--build-arg DISTRO=debian-bookworm \
--build-arg OSMOCOM_REPO_MIRROR=https://downloads.osmocom.org \
--build-arg OSMOCOM_REPO_PATH=packages/osmocom: \
--build-arg OSMOCOM_REPO_VERSION=latest \
--build-arg OSMOCOM_REPO_TESTSUITE_MIRROR=https://downloads.osmocom.org \
--build-arg ASTERISK_BRANCH=sysmocom/20.7.0 \
--build-arg LIBOSMOCORE_BRANCH=master \
--build-arg OSMO_BB_BRANCH=master \
--build-arg OSMO_BSC_BRANCH=master \
--build-arg OSMO_BTS_BRANCH=master \
--build-arg OSMO_CBC_BRANCH=master \
--build-arg OSMO_DIA2GSUP_BRANCH=master \
--build-arg OSMO_EPDG_BRANCH=master \
--build-arg OSMO_GBPROXY_BRANCH=master \
--build-arg OSMO_GGSN_BRANCH=master \
--build-arg OSMO_GSM_TESTER_BRANCH=master \
--build-arg OSMO_HLR_BRANCH=master \
--build-arg OSMO_HNBGW_BRANCH=master \
--build-arg OSMO_HNODEB_BRANCH=master \
--build-arg OSMO_IUH_BRANCH=master \
--build-arg OSMO_MGW_BRANCH=master \
--build-arg OSMO_MSC_BRANCH=master \
--build-arg OSMO_NITB_BRANCH=master \
--build-arg OSMO_PCU_BRANCH=master \
--build-arg OSMO_REMSIM_BRANCH=master \
--build-arg OSMO_S1GW_BRANCH=master \
--build-arg OSMO_SGSN_BRANCH=master \
--build-arg OSMO_SIP_BRANCH=master \
--build-arg OSMO_STP_BRANCH=master \
--build-arg OSMO_UECUPS_BRANCH=master \
--build-arg OPEN5GS_BRANCH=main \
--build-arg PJPROJECT_BRANCH=sysmocom/2.14 \
-t docker.io/osmocom-build/osmo-gsm-tester:latest .
#0 building with "default" instance using docker driver
#1 [internal] load build definition from Dockerfile
#1 transferring dockerfile: 4.84kB done
#1 WARN: InvalidDefaultArgInFrom: Default value for ARG $USER/debian-bookworm-build results in empty or invalid base image name (line 2)
#1 WARN: LegacyKeyValueFormat: "ENV key=value" should be used instead of legacy "ENV key value" format (line 65)
#1 DONE 0.0s
#2 [internal] load metadata for docker.io/osmocom-build/debian-bookworm-build:latest
#2 DONE 0.0s
#3 [internal] load .dockerignore
#3 transferring context: 2B done
#3 DONE 0.0s
#4 [ 1/28] FROM docker.io/osmocom-build/debian-bookworm-build:latest
#4 DONE 0.0s
#5 [internal] load build context
#5 transferring context: 5.76kB done
#5 DONE 0.1s
#6 [22/28] ADD HTTPS://GERRIT.OSMOCOM.ORG/PLUGINS/GITILES/OSMO-GSM-TESTER/+/MASTER?FORMAT=TEXT /tmp/commit
#6 DONE 0.1s
#7 [16/28] RUN APT-GET update && apt-get install -y --no-install-recommends cmake libfftw3-dev libmbedtls-dev libboost-program-options-dev libconfig++-dev libsctp-dev libpcsclite-dev libuhd-dev libczmq-dev libsoapysdr-dev soapysdr-module-lms7 && apt-get clean
#7 CACHED
#8 [11/28] RUN chmod -R 0700 /home/jenkins/.ssh /root/.ssh
#8 CACHED
#9 [ 6/28] RUN PIP3 install --break-system-packages "git+https://github.com/podshumok/python-smpplib.git@master#egg=smpplib" pydbus pyusb pysispm pymongo
#9 CACHED
#10 [ 3/28] RUN groupadd osmo-gsm-tester
#10 CACHED
#11 [ 4/28] RUN usermod -a -G osmo-gsm-tester jenkins
#11 CACHED
#12 [ 2/28] RUN useradd -ms /bin/bash jenkins
#12 CACHED
#13 [ 9/28] COPY SSH /root/.ssh
#13 CACHED
#14 [12/28] RUN MKDIR -p /osmo-gsm-tester-srsue /osmo-gsm-tester-srsenb /osmo-gsm-tester-srsepc /osmo-gsm-tester-trx /osmo-gsm-tester-grbroker /osmo-gsm-tester-open5gs
#14 CACHED
#15 [10/28] COPY --CHOWN=JENKINS:JENKINS ssh /home/jenkins/.ssh
#15 CACHED
#16 [ 8/28] RUN MKDIR /var/run/sshd
#16 CACHED
#17 [13/28] RUN CHOWN -R jenkins:jenkins /osmo-gsm-tester-*
#17 CACHED
#18 [15/28] RUN APT-GET update && apt-get install -y --no-install-recommends telnet libosmocore-dev libosmo-abis-dev libosmo-gsup-client-dev libosmo-netif-dev libosmo-ranap-dev libosmo-sigtran-dev libsmpp34-dev libgtp-dev libasn1c-dev && apt-get clean
#18 CACHED
#19 [ 7/28] RUN APT-GET update && apt-get install -y openssh-server
#19 CACHED
#20 [ 5/28] RUN APT-GET update && apt-get install -y --no-install-recommends cpio dbus tcpdump sqlite3 python3 python3-setuptools python3-yaml python3-mako python3-gi python3-numpy python3-wheel python3-watchdog ofono patchelf rpm2cpio sudo libcap2-bin python3-pip udhcpc iperf3 locales
#20 CACHED
#21 [14/28] RUN sed -i -e 's/# en_US.UTF-8 UTF-8/en_US.UTF-8 UTF-8/' /etc/locale.gen && dpkg-reconfigure --frontend=noninteractive locales && update-locale LANG=en_US.UTF-8
#21 CACHED
#22 [17/28] RUN APT-GET update && apt-get install -y --no-install-recommends gnuradio && apt-get clean
#22 CACHED
#6 [22/28] ADD HTTPS://GERRIT.OSMOCOM.ORG/PLUGINS/GITILES/OSMO-GSM-TESTER/+/MASTER?FORMAT=TEXT /tmp/commit
#6 CACHED
#23 [18/28] RUN SET -x && mkdir -p /tmp/mongodb && cd /tmp/mongodb && wget "https://pgp.mongodb.com/server-5.0.asc" -O "/mongodb.key" && wget "http://security.debian.org/debian-security/pool/updates/main/o/openssl/libssl1.1_1.1.1n-0+deb10u6_amd64.deb" && dpkg -i "libssl1.1_1.1.1n-0+deb10u6_amd64.deb" && echo "deb [signed-by=/mongodb.key] http://repo.mongodb.org/apt/debian bullseye/mongodb-org/5.0 main" > /etc/apt/sources.list.d/mongodb-org.list && apt-get update && apt-get install -y mongodb-org && apt-get clean && cd / && rm -rf /tmp/mongodb && rm /etc/apt/sources.list.d/mongodb-org.list && sed -i "s/127.0.0.1/172.18.50.2/g" /etc/mongod.conf
#23 0.344 + mkdir -p /tmp/mongodb
#23 0.344 + cd /tmp/mongodb
#23 0.344 + wget https://pgp.mongodb.com/server-5.0.asc -O /mongodb.key
#23 0.346 --2025-07-29 13:27:56-- https://pgp.mongodb.com/server-5.0.asc
#23 0.352 Resolving pgp.mongodb.com (pgp.mongodb.com)... 99.84.152.76, 99.84.152.66, 99.84.152.50, ...
#23 0.353 Connecting to pgp.mongodb.com (pgp.mongodb.com)|99.84.152.76|:443... connected.
#23 0.380 HTTP request sent, awaiting response... 200 OK
#23 0.680 Length: 1656 (1.6K) [binary/octet-stream]
#23 0.680 Saving to: ‘/mongodb.key’
#23 0.680
#23 0.680 0K . 100% 20.1M=0s
#23 0.680
#23 0.680 2025-07-29 13:27:57 (20.1 MB/s) - ‘/mongodb.key’ saved [1656/1656]
#23 0.680
#23 0.682 + wget http://security.debian.org/debian-security/pool/updates/main/o/openssl/libssl1.1_1.1.1n-0+deb10u6_amd64.deb
#23 0.688 --2025-07-29 13:27:57-- http://security.debian.org/debian-security/pool/updates/main/o/openssl/libssl1.1_1.1.1n-0+deb10u6_amd64.deb
#23 0.688 Resolving security.debian.org (security.debian.org)... 151.101.194.132, 151.101.2.132, 151.101.130.132, ...
#23 0.689 Connecting to security.debian.org (security.debian.org)|151.101.194.132|:80... connected.
#23 0.694 HTTP request sent, awaiting response... 404 Not Found
#23 0.701 2025-07-29 13:27:57 ERROR 404: Not Found.
#23 0.701
#23 ERROR: process "/bin/sh -c set -x && \tmkdir -p /tmp/mongodb && \tcd /tmp/mongodb && \twget \"https://pgp.mongodb.com/server-5.0.asc\" -O \"/mongodb.key\" && \twget \"http://security.debian.org/debian-security/pool/updates/main/o/openssl/libssl1.1_1.1.1n-0+deb10u6_amd64.deb\" && \tdpkg -i \"libssl1.1_1.1.1n-0+deb10u6_amd64.deb\" && \techo \"deb [signed-by=/mongodb.key] http://repo.mongodb.org/apt/debian bullseye/mongodb-org/5.0 main\" \t\t> /etc/apt/sources.list.d/mongodb-org.list && \tapt-get update && \tapt-get install -y mongodb-org && \tapt-get clean && \tcd / && \trm -rf /tmp/mongodb && \trm /etc/apt/sources.list.d/mongodb-org.list && \tsed -i \"s/127.0.0.1/$OGT_MASTER_ADDR/g\" /etc/mongod.conf" did not complete successfully: exit code: 8
------
> [18/28] RUN SET -x && mkdir -p /tmp/mongodb && cd /tmp/mongodb && wget "https://pgp.mongodb.com/server-5.0.asc" -O "/mongodb.key" && wget "http://security.debian.org/debian-security/pool/updates/main/o/openssl/libssl1.1_1.1.1n-0+deb10u6_amd64.deb" && dpkg -i "libssl1.1_1.1.1n-0+deb10u6_amd64.deb" && echo "deb [signed-by=/mongodb.key] http://repo.mongodb.org/apt/debian bullseye/mongodb-org/5.0 main" > /etc/apt/sources.list.d/mongodb-org.list && apt-get update && apt-get install -y mongodb-org && apt-get clean && cd / && rm -rf /tmp/mongodb && rm /etc/apt/sources.list.d/mongodb-org.list && sed -i "s/127.0.0.1/172.18.50.2/g" /etc/mongod.conf:
0.680
0.680 2025-07-29 13:27:57 (20.1 MB/s) - ‘/mongodb.key’ saved [1656/1656]
0.680
0.682 + wget http://security.debian.org/debian-security/pool/updates/main/o/openssl/libssl1.1_1.1.1n-0+deb10u6_amd64.deb
0.688 --2025-07-29 13:27:57-- http://security.debian.org/debian-security/pool/updates/main/o/openssl/libssl1.1_1.1.1n-0+deb10u6_amd64.deb
0.688 Resolving security.debian.org (security.debian.org)... 151.101.194.132, 151.101.2.132, 151.101.130.132, ...
0.689 Connecting to security.debian.org (security.debian.org)|151.101.194.132|:80... connected.
0.694 HTTP request sent, awaiting response... 404 Not Found
0.701 2025-07-29 13:27:57 ERROR 404: Not Found.
0.701
------
Dockerfile:105
--------------------
104 | # package is not available. Furthermore, manually install required libssl1.1.
105 | >>> RUN set -x && \
106 | >>> mkdir -p /tmp/mongodb && \
107 | >>> cd /tmp/mongodb && \
108 | >>> wget "https://pgp.mongodb.com/server-5.0.asc" -O "/mongodb.key" && \
109 | >>> wget "http://security.debian.org/debian-security/pool/updates/main/o/openssl/libssl1.1_1.1.1n-0+deb10u6_amd64.deb" && \
110 | >>> dpkg -i "libssl1.1_1.1.1n-0+deb10u6_amd64.deb" && \
111 | >>> echo "deb [signed-by=/mongodb.key] http://repo.mongodb.org/apt/debian bullseye/mongodb-org/5.0 main" \
112 | >>> > /etc/apt/sources.list.d/mongodb-org.list && \
113 | >>> apt-get update && \
114 | >>> apt-get install -y mongodb-org && \
115 | >>> apt-get clean && \
116 | >>> cd / && \
117 | >>> rm -rf /tmp/mongodb && \
118 | >>> rm /etc/apt/sources.list.d/mongodb-org.list && \
119 | >>> sed -i "s/127.0.0.1/$OGT_MASTER_ADDR/g" /etc/mongod.conf
120 |
--------------------
ERROR: failed to solve: process "/bin/sh -c set -x && \tmkdir -p /tmp/mongodb && \tcd /tmp/mongodb && \twget \"https://pgp.mongodb.com/server-5.0.asc\" -O \"/mongodb.key\" && \twget \"http://security.debian.org/debian-security/pool/updates/main/o/openssl/libssl1.1_1.1.1n-0+deb10u6_amd64.deb\" && \tdpkg -i \"libssl1.1_1.1.1n-0+deb10u6_amd64.deb\" && \techo \"deb [signed-by=/mongodb.key] http://repo.mongodb.org/apt/debian bullseye/mongodb-org/5.0 main\" \t\t> /etc/apt/sources.list.d/mongodb-org.list && \tapt-get update && \tapt-get install -y mongodb-org && \tapt-get clean && \tcd / && \trm -rf /tmp/mongodb && \trm /etc/apt/sources.list.d/mongodb-org.list && \tsed -i \"s/127.0.0.1/$OGT_MASTER_ADDR/g\" /etc/mongod.conf" did not complete successfully: exit code: 8
make: *** [../make/Makefile:96: docker-build] Error 1
make: Leaving directory '<https://jenkins.osmocom.org/jenkins/job/osmo-gsm-tester_build-osmo-msc/ws/docker-playground/osmo-gsm-tester'>
Build step 'Execute shell' marked build as failure
Skipped archiving because build is not successful
participants (1)
-
jenkins@lists.osmocom.org