Changes:
------------------------------------------ Started by upstream project "master-osmo-pcu" build number 8393 originally caused by: Started by timer Running as SYSTEM Building remotely on rpi4-raspbian12build-ansible-3 (raspbian) in workspace /home/osmocom-build/jenkins/workspace/master-osmo-pcu/FIRMWARE_VERSION/master/WITH_MANUALS/0/label/raspbian/with_dsp/none/with_vty/False [ssh-agent] Looking for ssh-agent implementation... $ ssh-agent SSH_AUTH_SOCK=/tmp/ssh-NbjGZifslefy/agent.1034746 SSH_AGENT_PID=1034750 [ssh-agent] Started. Running ssh-add (command line suppressed) [ssh-agent] Using credentials docs (OS#5798) The recommended git tool is: NONE No credentials specified Cloning the remote Git repository Cloning repository https://gerrit.osmocom.org/osmo-pcu
git init /home/osmocom-build/jenkins/workspace/master-osmo-pcu/FIRMWARE_VERSION/master/WITH_MANUALS/0/label/raspbian/with_dsp/none/with_vty/False # timeout=10
Fetching upstream changes from https://gerrit.osmocom.org/osmo-pcu
git --version # timeout=10 git --version # 'git version 2.47.3' git fetch --tags --force --progress -- https://gerrit.osmocom.org/osmo-pcu +refs/heads/*:refs/remotes/origin/* # timeout=10 git config remote.origin.url https://gerrit.osmocom.org/osmo-pcu # timeout=10 git config --add remote.origin.fetch +refs/heads/*:refs/remotes/origin/* # timeout=10
Avoid second fetch Checking out Revision 379d74689e1a93b20be554a76f8db4db37801980 (origin/master)
git config core.sparsecheckout # timeout=10 git checkout -f 379d74689e1a93b20be554a76f8db4db37801980 # timeout=10
Commit message: "llc: fix misaligned MetaInfo access in msgb headroom"
git rev-list --no-walk 379d74689e1a93b20be554a76f8db4db37801980 # timeout=10
[False] $ /bin/sh -xe /tmp/jenkins17193394244198597469.sh + DOCKER_IMG=osmocom-build/debian-trixie-build + arch + DOCKER_IMG=osmocom-build/debian-trixie-build-arm + SETARCH_CMD=setarch linux32 + CCACHE_DIR=/home/osmocom-build/ccache/master-builds + mkdir -p /home/osmocom-build/ccache/master-builds + chown osmocom-build:osmocom-build /home/osmocom-build/ccache/master-builds + readlink -f /tmp/ssh-NbjGZifslefy/agent.1034746 + docker run --rm=true --cap-add SYS_PTRACE --security-opt seccomp=/home/osmocom-build/osmo-ci/_docker_playground/seccomp_profile.json --ulimit fsize=1000000000 -e ASCIIDOC_WARNINGS_CHECK=1 -e CFLAGS=-g -e HOME=/build -e IS_MASTER_BUILD=1 -e JOB_NAME=master-osmo-pcu/FIRMWARE_VERSION=master,WITH_MANUALS=0,label=raspbian,with_dsp=none,with_vty=False -e MAKE=make -e OSMOPY_DEBUG_TCP_SOCKETS=1 -e OSMO_GSM_MANUALS_DIR=/opt/osmo-gsm-manuals -e PARALLEL_MAKE=-j 4 -e PUBLISH=1 -e SSH_AUTH_SOCK=/ssh-agent -e WITH_MANUALS=1 -w /build -i -u build -v /tmp/ssh-NbjGZifslefy/agent.1034746:/ssh-agent -v /home/osmocom-build/osmo-ci:/osmo-ci:ro -v /home/osmocom-build/jenkins/workspace/master-osmo-pcu/FIRMWARE_VERSION/master/WITH_MANUALS/0/label/raspbian/with_dsp/none/with_vty/False:/build -v /home/osmocom-build/.ssh:/home/build/.ssh:ro -e CCACHE_DIR=/ccache -e PATH=/usr/lib/ccache:/usr/local/sbin:/usr/local/bin:/usr/sbin:/usr/bin:/sbin:/bin -v /home/osmocom-build/ccache/master-builds:/ccache -e FIRMWARE_VERSION=master -e with_vty=False -e with_dsp=none -e WITH_MANUALS=0 osmocom-build/debian-trixie-build-arm /usr/bin/timeout 30m /osmo-ci/scripts/wrapper_core_bt_on_error.sh setarch linux32 /build/contrib/jenkins.sh + [ -z make ] + base=/build + deps=/build/deps + inst=/build/deps/install + export deps inst + osmo-clean-workspace.sh + chmod -R +w . + git checkout -f HEAD + git clean -dxf + [ -d /build/deps ] + [ -d layer1-headers ] + mkdir /build/deps + PCU_CONFIG=Ericsson E1 CCU support enabled, sanitizer enabled VTY tests disabled
+ [ none = sysmo ] + [ none = lc15 ] + [ none = oc2g ] + [ -z none -o none = none ] + echo Ericsson E1 CCU support enabled, sanitizer enabled + PCU_CONFIG= --enable-werror --enable-sanitize --enable-er-e1-ccu + [ False = True ] + [ -z False -o False = False ] + echo VTY tests disabled + find . -name *.[hc] + verify_value_string_arrays_are_terminated.py ./include/osmocom/pcu/pcuif_proto.h ./src/pcuif_sock.c ./src/csn1_dec.c ./src/gsm_rlcmac.c ./src/tbf_dl.h ./src/pcu_vty.h ./src/decoding.h ./src/csn1_enc.c ./src/encoding.h ./src/pcu_vty.c ./src/tbf.h ./src/tbf_ul_fsm.c ./src/pdch_ul_controller.c ./src/gprs_bssgp_pcu.h ./src/csn1.c ./src/mslot_class.c ./src/mslot_class.h ./src/tbf_ul_ass_fsm.c ./src/sba.c ./src/gsm_rlcmac.h ./src/llc.h ./src/csn1.h ./src/gprs_codel.c ./src/pcu_utils.h ./src/rlc.h ./src/gprs_debug.h ./src/tbf_ul_ass_fsm.h ./src/rlc_window.h ./src/tbf_ul.h ./src/gprs_bssgp_pcu.c ./src/osmo-bts-sysmo/sysmo_l1_if.c ./src/osmo-bts-sysmo/femtobts.c ./src/osmo-bts-sysmo/sysmo_l1_fwd.c ./src/osmo-bts-sysmo/sysmo_l1_if.h ./src/osmo-bts-sysmo/femtobts.h ./src/osmo-bts-sysmo/sysmo_l1_hw.c ./src/pcu_l1_if.h ./src/gprs_ms.c ./src/neigh_cache.h ./src/bts_pch_timer.c ./src/gprs_ms.h ./src/nacc_fsm.c ./src/alloc_algo.h ./src/gprs_bssgp_rim.c ./src/gprs_codel.h ./src/rlc_window_ul.h ./src/egprs_rlc_compression.h ./src/pcu_l1_if_phy.h ./src/wireshark_compat.h ./src/tbf_dl_ass_fsm.h ./src/rlc_window_dl.h ./src/tbf_ul_ack_fsm.h ./src/gprs_debug.c ./src/coding_scheme.c ./src/cxx_linuxlist.h ./src/tbf_fsm.c ./src/gprs_rlcmac.c ./src/pcu_vty_functions.h ./src/neigh_cache.c ./src/tbf_fsm.h ./src/llc.c ./src/ericsson-rbs/er_ccu_if.h ./src/ericsson-rbs/er_ccu_if.c ./src/ericsson-rbs/er_ccu_descr.h ./src/ericsson-rbs/er_ccu_l1_if.c ./src/gprs_bssgp_rim.h ./src/coding_scheme.h ./src/osmo-bts-oc2g/oc2g_l1_if.c ./src/osmo-bts-oc2g/oc2g_l1_if.h ./src/osmo-bts-oc2g/oc2g_l1_hw.c ./src/osmo-bts-oc2g/oc2gbts.c ./src/osmo-bts-oc2g/oc2gbts.h ./src/gprs_pcu.h ./src/tbf_dl_fsm.c ./src/tbf_ul_ack_fsm.c ./src/tbf_dl_ass_fsm.c ./src/gprs_rlcmac.h ./src/bts.h ./src/pdch.h ./src/nacc_fsm.h ./src/sba.h ./src/bts_pch_timer.h ./src/pdch_ul_controller.h ./src/gprs_pcu.c ./src/osmo-bts-litecell15/lc15bts.c ./src/osmo-bts-litecell15/lc15bts.h ./src/osmo-bts-litecell15/lc15_l1_if.h ./src/osmo-bts-litecell15/lc15_l1_hw.c ./src/osmo-bts-litecell15/lc15_l1_if.c ./tests/codel/codel_test.c ./tests/emu/openbsc_clone.c ./tests/emu/gprs_tests.h ./tests/emu/openbsc_clone.h + osmo-build-dep.sh libosmocore --disable-doxygen
=============================== libosmocore ===============================
+ mkdir -p /build/deps + cd /build/deps + osmo-deps.sh libosmocore + project=libosmocore + branch=master + git branch -a + grep -c remotes/origin/master$ + [ x1 != x0 ] + branch=origin/master + test -d libosmocore + osmo_git_clone_url libosmocore + echo https://gerrit.osmocom.org/libosmocore + git clone https://gerrit.osmocom.org/libosmocore libosmocore Cloning into 'libosmocore'... error: RPC failed; curl 56 Recv failure: Connection reset by peer error: 31422 bytes of body are still expected fetch-pack: unexpected disconnect while reading sideband packet fatal: early EOF fatal: fetch-pack: invalid index-pack output FATAL: command execution failed hudson.remoting.ProxyException: java.util.concurrent.TimeoutException: Ping started at 1789457536326 hasn't completed by 1789457776326 at hudson.remoting.PingThread.ping(PingThread.java:135) Caused: Command Close created at at hudson.remoting.Command.<init>(Command.java:69) at hudson.remoting.Channel$CloseCommand.<init>(Channel.java:1424) at hudson.remoting.Channel.close(Channel.java:1603) at Jenkins v2.568.3//hudson.slaves.ChannelPinger$1.onDead(ChannelPinger.java:206) at hudson.remoting.PingThread.ping(PingThread.java:134) at hudson.remoting.PingThread.run(PingThread.java:87) Caused: hudson.remoting.Channel$OrderlyShutdown at hudson.remoting.Channel$CloseCommand.execute(Channel.java:1431) at hudson.remoting.Channel$1.handle(Channel.java:664) at hudson.remoting.SynchronousCommandTransport$ReaderThread.run(SynchronousCommandTransport.java:86) Caused: java.io.IOException: Backing channel 'rpi4-raspbian12build-ansible-3' is disconnected. at hudson.remoting.RemoteInvocationHandler.channelOrFail(RemoteInvocationHandler.java:227) at hudson.remoting.RemoteInvocationHandler.invoke(RemoteInvocationHandler.java:306) at jdk.proxy2/jdk.proxy2.$Proxy129.isAlive(Unknown Source) at hudson.Launcher$RemoteLauncher$ProcImpl.isAlive(Launcher.java:1227) at hudson.Launcher$RemoteLauncher$ProcImpl.join(Launcher.java:1219) at hudson.tasks.CommandInterpreter.join(CommandInterpreter.java:195) at hudson.tasks.CommandInterpreter.perform(CommandInterpreter.java:145) at hudson.tasks.CommandInterpreter.perform(CommandInterpreter.java:92) at hudson.tasks.BuildStepMonitor$1.perform(BuildStepMonitor.java:20) at hudson.model.AbstractBuild$AbstractBuildExecution.perform(AbstractBuild.java:817) at hudson.model.Build$BuildExecution.build(Build.java:199) at hudson.model.Build$BuildExecution.doRun(Build.java:164) at hudson.model.AbstractBuild$AbstractBuildExecution.run(AbstractBuild.java:526) at hudson.model.Run.execute(Run.java:1849) at PluginClassLoader for matrix-project//hudson.matrix.MatrixRun.run(MatrixRun.java:153) at hudson.model.ResourceController.execute(ResourceController.java:97) at hudson.model.Executor.run(Executor.java:456) FATAL: Unable to delete script file /tmp/jenkins17193394244198597469.sh hudson.remoting.ProxyException: java.util.concurrent.TimeoutException: Ping started at 1789457536326 hasn't completed by 1789457776326 at hudson.remoting.PingThread.ping(PingThread.java:135) Caused: Command Close created at at hudson.remoting.Command.<init>(Command.java:69) at hudson.remoting.Channel$CloseCommand.<init>(Channel.java:1424) at hudson.remoting.Channel.close(Channel.java:1603) at Jenkins v2.568.3//hudson.slaves.ChannelPinger$1.onDead(ChannelPinger.java:206) at hudson.remoting.PingThread.ping(PingThread.java:134) at hudson.remoting.PingThread.run(PingThread.java:87) Caused: hudson.remoting.Channel$OrderlyShutdown at hudson.remoting.Channel$CloseCommand.execute(Channel.java:1431) at hudson.remoting.Channel$1.handle(Channel.java:664) at hudson.remoting.SynchronousCommandTransport$ReaderThread.run(SynchronousCommandTransport.java:86) Caused: hudson.remoting.ChannelClosedException: Channel "hudson.remoting.Channel@5b1d8197:rpi4-raspbian12build-ansible-3": Remote call on rpi4-raspbian12build-ansible-3 failed. The channel is closing down or has closed down at hudson.remoting.Channel.call(Channel.java:1101) at hudson.FilePath.act(FilePath.java:1220) at hudson.FilePath.act(FilePath.java:1209) at hudson.FilePath.delete(FilePath.java:1756) at hudson.tasks.CommandInterpreter.perform(CommandInterpreter.java:163) at hudson.tasks.CommandInterpreter.perform(CommandInterpreter.java:92) at hudson.tasks.BuildStepMonitor$1.perform(BuildStepMonitor.java:20) at hudson.model.AbstractBuild$AbstractBuildExecution.perform(AbstractBuild.java:817) at hudson.model.Build$BuildExecution.build(Build.java:199) at hudson.model.Build$BuildExecution.doRun(Build.java:164) at hudson.model.AbstractBuild$AbstractBuildExecution.run(AbstractBuild.java:526) at hudson.model.Run.execute(Run.java:1849) at PluginClassLoader for matrix-project//hudson.matrix.MatrixRun.run(MatrixRun.java:153) at hudson.model.ResourceController.execute(ResourceController.java:97) at hudson.model.Executor.run(Executor.java:456) Build step 'Execute shell' marked build as failure ERROR: Unable to tear down: Channel "hudson.remoting.Channel@5b1d8197:rpi4-raspbian12build-ansible-3": Remote call on rpi4-raspbian12build-ansible-3 failed. The channel is closing down or has closed down hudson.remoting.ProxyException: java.util.concurrent.TimeoutException: Ping started at 1789457536326 hasn't completed by 1789457776326 at hudson.remoting.PingThread.ping(PingThread.java:135) Caused: Command Close created at at hudson.remoting.Command.<init>(Command.java:69) at hudson.remoting.Channel$CloseCommand.<init>(Channel.java:1424) at hudson.remoting.Channel.close(Channel.java:1603) at Jenkins v2.568.3//hudson.slaves.ChannelPinger$1.onDead(ChannelPinger.java:206) at hudson.remoting.PingThread.ping(PingThread.java:134) at hudson.remoting.PingThread.run(PingThread.java:87) Caused: hudson.remoting.Channel$OrderlyShutdown at hudson.remoting.Channel$CloseCommand.execute(Channel.java:1431) at hudson.remoting.Channel$1.handle(Channel.java:664) at hudson.remoting.SynchronousCommandTransport$ReaderThread.run(SynchronousCommandTransport.java:86) Caused: hudson.remoting.ChannelClosedException: Channel "hudson.remoting.Channel@5b1d8197:rpi4-raspbian12build-ansible-3": Remote call on rpi4-raspbian12build-ansible-3 failed. The channel is closing down or has closed down at hudson.remoting.Channel.call(Channel.java:1101) at hudson.Launcher$RemoteLauncher.launch(Launcher.java:1136) at hudson.Launcher$ProcStarter.start(Launcher.java:507) at PluginClassLoader for ssh-agent//com.cloudbees.jenkins.plugins.sshagent.exec.ExecRemoteAgent.executeCommand(ExecRemoteAgent.java:161) at PluginClassLoader for ssh-agent//com.cloudbees.jenkins.plugins.sshagent.exec.ExecRemoteAgent.stop(ExecRemoteAgent.java:253) at PluginClassLoader for ssh-agent//com.cloudbees.jenkins.plugins.sshagent.SSHAgentBuildWrapper$SSHAgentEnvironment.tearDown(SSHAgentBuildWrapper.java:411) at hudson.model.AbstractBuild$AbstractBuildExecution.tearDownBuildEnvironments(AbstractBuild.java:566) at hudson.model.AbstractBuild$AbstractBuildExecution.run(AbstractBuild.java:530) at hudson.model.Run.execute(Run.java:1849) at PluginClassLoader for matrix-project//hudson.matrix.MatrixRun.run(MatrixRun.java:153) at hudson.model.ResourceController.execute(ResourceController.java:97) at hudson.model.Executor.run(Executor.java:456) ERROR: Step ‘Archive the artifacts’ failed: no workspace for master-osmo-pcu/FIRMWARE_VERSION=master,WITH_MANUALS=0,label=raspbian,with_dsp=none,with_vty=False #8393
jenkins-notifications@lists.osmocom.org