Build failed in Jenkins: master-osmo-msc » --enable-iu,0,a3=default,a4=default,osmocom-master-debian9 #25994

jenkins at lists.osmocom.org jenkins at lists.osmocom.org
Wed Aug 18 06:28:20 UTC 2021


See <https://jenkins.osmocom.org/jenkins/job/master-osmo-msc/IU=--enable-iu,WITH_MANUALS=0,a3=default,a4=default,label=osmocom-master-debian9/25994/display/redirect>

Changes:


------------------------------------------
[...truncated 800.35 KB...]


> ss -tln
State      Recv-Q Send-Q Local Address:Port               Peer Address:Port              


> ps xua | grep osmo
build     9326  6.0  0.0  54224 21416 ?        S    06:28   0:00 /usr/bin/python3 /usr/local/bin/osmotestconfig.py -p /build -w /build -v
build     9338  0.0  0.0 21474989712 22980 ?   R    06:28   0:00 src/osmo-msc/osmo-msc -c /build/writtenconfig/osmo-msc.cfglpowhnzo
build     9345  0.0  0.0   4280   708 ?        S    06:28   0:00 /bin/sh -c ps xua | grep osmo
build     9347  0.0  0.0  12784  1028 ?        S    06:28   0:00 grep osmo

Connecting socket failed, retrying...
Socket: in 2 tries, connected to 127.0.0.1:4254 <socket.socket fd=5, family=AddressFamily.AF_INET, type=SocketKind.SOCK_STREAM, proto=0, laddr=('127.0.0.1', 51276), raddr=('127.0.0.1', 4254)> (1 sockets open)
Terminating took 0.475s
Socket: closing 127.0.0.1:4254 <socket.socket fd=5, family=AddressFamily.AF_INET, type=SocketKind.SOCK_STREAM, proto=0, laddr=('127.0.0.1', 51276), raddr=('127.0.0.1', 4254)> (0 sockets open)
Verifying src/osmo-msc/osmo-msc -c /build/writtenconfig/osmo-msc.cfglpowhnzo, test token_vty_command
Launching: PWD=/build 'src/osmo-msc/osmo-msc' '-c' '/build/writtenconfig/osmo-msc.cfglpowhnzo'

> ls -l /proc/9326/fd
total 0
lr-x------ 1 build build 64 Aug 18 06:28 0 -> pipe:[470516059]
l-wx------ 1 build build 64 Aug 18 06:28 1 -> pipe:[470516060]
l-wx------ 1 build build 64 Aug 18 06:28 2 -> pipe:[470516061]
l-wx------ 1 build build 64 Aug 18 06:28 3 -> /dev/null


> ss -tn
State      Recv-Q Send-Q Local Address:Port               Peer Address:Port              


> ss -tln
State      Recv-Q Send-Q Local Address:Port               Peer Address:Port              


> ps xua | grep osmo
build     9326  4.3  0.0  54224 21416 ?        S    06:28   0:00 /usr/bin/python3 /usr/local/bin/osmotestconfig.py -p /build -w /build -v
build     9349  0.0  0.0 21474989712 25520 ?   R    06:28   0:00 src/osmo-msc/osmo-msc -c /build/writtenconfig/osmo-msc.cfglpowhnzo
build     9356  0.0  0.0   4280   700 ?        S    06:28   0:00 /bin/sh -c ps xua | grep osmo
build     9358  0.0  0.0  12784  1028 ?        S    06:28   0:00 grep osmo

Socket: in 1 tries, connected to 127.0.0.1:4254 <socket.socket fd=4, family=AddressFamily.AF_INET, type=SocketKind.SOCK_STREAM, proto=0, laddr=('127.0.0.1', 51278), raddr=('127.0.0.1', 4254)> (1 sockets open)
Terminating took 0.897s
Socket: closing 127.0.0.1:4254 <socket.socket fd=4, family=AddressFamily.AF_INET, type=SocketKind.SOCK_STREAM, proto=0, laddr=('127.0.0.1', 51278), raddr=('127.0.0.1', 4254)> (0 sockets open)
Verifying src/osmo-msc/osmo-msc -c /build/doc/examples/osmo-msc/osmo-msc_custom-sccp.cfg, test verify_doc
Launching: PWD=/build 'src/osmo-msc/osmo-msc' '-c' '/build/doc/examples/osmo-msc/osmo-msc_custom-sccp.cfg'

> ls -l /proc/9326/fd
total 0
lr-x------ 1 build build 64 Aug 18 06:28 0 -> pipe:[470516059]
l-wx------ 1 build build 64 Aug 18 06:28 1 -> pipe:[470516060]
l-wx------ 1 build build 64 Aug 18 06:28 2 -> pipe:[470516061]
l-wx------ 1 build build 64 Aug 18 06:28 3 -> /dev/null


> ss -tn
State      Recv-Q Send-Q Local Address:Port               Peer Address:Port              


> ss -tln
State      Recv-Q Send-Q Local Address:Port               Peer Address:Port              


> ps xua | grep osmo
build     9326  2.6  0.0  54224 21416 ?        S    06:28   0:00 /usr/bin/python3 /usr/local/bin/osmotestconfig.py -p /build -w /build -v
build     9360  0.0  0.0 21474995340 27344 ?   R    06:28   0:00 src/osmo-msc/osmo-msc -c /build/doc/examples/osmo-msc/osmo-msc_custom-sccp.cfg
build     9367  0.0  0.0   4280   796 ?        S    06:28   0:00 /bin/sh -c ps xua | grep osmo
build     9369  0.0  0.0  12784   964 ?        S    06:28   0:00 grep osmo

Socket: in 1 tries, connected to 127.0.0.1:4254 <socket.socket fd=4, family=AddressFamily.AF_INET, type=SocketKind.SOCK_STREAM, proto=0, laddr=('127.0.0.1', 51282), raddr=('127.0.0.1', 4254)> (1 sockets open)
Terminating took 0.897s
Socket: closing 127.0.0.1:4254 <socket.socket fd=4, family=AddressFamily.AF_INET, type=SocketKind.SOCK_STREAM, proto=0, laddr=('127.0.0.1', 51282), raddr=('127.0.0.1', 4254)> (0 sockets open)
Verifying src/osmo-msc/osmo-msc -c /build/writtenconfig/osmo-msc_custom-sccp.cfgqstc0kqn, test write_config
Launching: PWD=/build 'src/osmo-msc/osmo-msc' '-c' '/build/writtenconfig/osmo-msc_custom-sccp.cfgqstc0kqn'

> ls -l /proc/9326/fd
total 0
lr-x------ 1 build build 64 Aug 18 06:28 0 -> pipe:[470516059]
l-wx------ 1 build build 64 Aug 18 06:28 1 -> pipe:[470516060]
l-wx------ 1 build build 64 Aug 18 06:28 2 -> pipe:[470516061]
l-wx------ 1 build build 64 Aug 18 06:28 3 -> /dev/null


> ss -tn
Documentation error (missing docs): 
<command id='no mgw reset-endpoint NAME'>
        <param name='NAME' doc='(null)' />

State      Recv-Q Send-Q Local Address:Port               Peer Address:Port              


> ss -tln
State      Recv-Q Send-Q Local Address:Port               Peer Address:Port              


> ps xua | grep osmo
build     9326  2.3  0.0  54356 21436 ?        S    06:28   0:00 /usr/bin/python3 /usr/local/bin/osmotestconfig.py -p /build -w /build -v
build     9371  0.0  0.0 21474995340 27464 ?   D    06:28   0:00 src/osmo-msc/osmo-msc -c /build/writtenconfig/osmo-msc_custom-sccp.cfgqstc0kqn
build     9378  0.0  0.0   4280   696 ?        S    06:28   0:00 /bin/sh -c ps xua | grep osmo
build     9380  0.0  0.0  12784   936 ?        S    06:28   0:00 grep osmo

Socket: in 1 tries, connected to 127.0.0.1:4254 <socket.socket fd=4, family=AddressFamily.AF_INET, type=SocketKind.SOCK_STREAM, proto=0, laddr=('127.0.0.1', 51284), raddr=('127.0.0.1', 4254)> (1 sockets open)
Terminating took 0.897s
Socket: closing 127.0.0.1:4254 <socket.socket fd=4, family=AddressFamily.AF_INET, type=SocketKind.SOCK_STREAM, proto=0, laddr=('127.0.0.1', 51284), raddr=('127.0.0.1', 4254)> (0 sockets open)
Verifying src/osmo-msc/osmo-msc -c /build/writtenconfig/osmo-msc_custom-sccp.cfgqstc0kqn, test token_vty_command
Launching: PWD=/build 'src/osmo-msc/osmo-msc' '-c' '/build/writtenconfig/osmo-msc_custom-sccp.cfgqstc0kqn'

> ls -l /proc/9326/fd
total 0
lr-x------ 1 build build 64 Aug 18 06:28 0 -> pipe:[470516059]
l-wx------ 1 build build 64 Aug 18 06:28 1 -> pipe:[470516060]
l-wx------ 1 build build 64 Aug 18 06:28 2 -> pipe:[470516061]
l-wx------ 1 build build 64 Aug 18 06:28 3 -> /dev/null


> ss -tn
State      Recv-Q Send-Q Local Address:Port               Peer Address:Port              


> ss -tln
State      Recv-Q Send-Q Local Address:Port               Peer Address:Port              


> ps xua | grep osmo
build     9326  1.7  0.0  54356 21436 ?        S    06:28   0:00 /usr/bin/python3 /usr/local/bin/osmotestconfig.py -p /build -w /build -v
build     9382  0.0  0.0 21474989712 25232 ?   R    06:28   0:00 src/osmo-msc/osmo-msc -c /build/writtenconfig/osmo-msc_custom-sccp.cfgqstc0kqn
build     9389  0.0  0.0   4280   708 ?        S    06:28   0:00 /bin/sh -c ps xua | grep osmo
build     9391  0.0  0.0  12784   988 ?        S    06:28   0:00 grep osmo

Connecting socket failed, retrying...
Socket: in 2 tries, connected to 127.0.0.1:4254 <socket.socket fd=5, family=AddressFamily.AF_INET, type=SocketKind.SOCK_STREAM, proto=0, laddr=('127.0.0.1', 51288), raddr=('127.0.0.1', 4254)> (1 sockets open)
Terminating took 0.897s
Socket: closing 127.0.0.1:4254 <socket.socket fd=5, family=AddressFamily.AF_INET, type=SocketKind.SOCK_STREAM, proto=0, laddr=('127.0.0.1', 51288), raddr=('127.0.0.1', 4254)> (0 sockets open)
Verifying src/osmo-msc/osmo-msc -c /build/doc/examples/osmo-msc/osmo-msc_multi-cs7.cfg, test verify_doc
Launching: PWD=/build 'src/osmo-msc/osmo-msc' '-c' '/build/doc/examples/osmo-msc/osmo-msc_multi-cs7.cfg'

> ls -l /proc/9326/fd
total 0
lr-x------ 1 build build 64 Aug 18 06:28 0 -> pipe:[470516059]
l-wx------ 1 build build 64 Aug 18 06:28 1 -> pipe:[470516060]
l-wx------ 1 build build 64 Aug 18 06:28 2 -> pipe:[470516061]
l-wx------ 1 build build 64 Aug 18 06:28 3 -> /dev/null


> ss -tn
State      Recv-Q Send-Q Local Address:Port               Peer Address:Port              


> ss -tln
State      Recv-Q Send-Q Local Address:Port               Peer Address:Port              


> ps xua | grep osmo
build     9326  1.6  0.0  54356 21436 ?        S    06:28   0:00 /usr/bin/python3 /usr/local/bin/osmotestconfig.py -p /build -w /build -v
build     9393  0.0  0.0 21474995340 27676 ?   D    06:28   0:00 src/osmo-msc/osmo-msc -c /build/doc/examples/osmo-msc/osmo-msc_multi-cs7.cfg
build     9400  0.0  0.0   4280   752 ?        S    06:28   0:00 /bin/sh -c ps xua | grep osmo
build     9402  0.0  0.0  12784   932 ?        S    06:28   0:00 grep osmo

Socket: in 1 tries, connected to 127.0.0.1:4254 <socket.socket fd=4, family=AddressFamily.AF_INET, type=SocketKind.SOCK_STREAM, proto=0, laddr=('127.0.0.1', 51296), raddr=('127.0.0.1', 4254)> (1 sockets open)
Terminating took 0.897s
Socket: closing 127.0.0.1:4254 <socket.socket fd=4, family=AddressFamily.AF_INET, type=SocketKind.SOCK_STREAM, proto=0, laddr=('127.0.0.1', 51296), raddr=('127.0.0.1', 4254)> (0 sockets open)
Verifying src/osmo-msc/osmo-msc -c /build/writtenconfig/osmo-msc_multi-cs7.cfg6emqv8r2, test write_config
Launching: PWD=/build 'src/osmo-msc/osmo-msc' '-c' '/build/writtenconfig/osmo-msc_multi-cs7.cfg6emqv8r2'

> ls -l /proc/9326/fd
total 0
lr-x------ 1 build build 64 Aug 18 06:28 0 -> pipe:[470516059]
l-wx------ 1 build build 64 Aug 18 06:28 1 -> pipe:[470516060]
l-wx------ 1 build build 64 Aug 18 06:28 2 -> pipe:[470516061]
l-wx------ 1 build build 64 Aug 18 06:28 3 -> /dev/null


> ss -tn
Documentation error (missing docs): 
<command id='no mgw reset-endpoint NAME'>
        <param name='NAME' doc='(null)' />

State      Recv-Q Send-Q Local Address:Port               Peer Address:Port              


> ss -tln
State      Recv-Q Send-Q Local Address:Port               Peer Address:Port              


> ps xua | grep osmo
build     9326  1.4  0.0  54356 21436 ?        S    06:28   0:00 /usr/bin/python3 /usr/local/bin/osmotestconfig.py -p /build -w /build -v
build     9404  0.0  0.0 21474995340 27692 ?   D    06:28   0:00 src/osmo-msc/osmo-msc -c /build/writtenconfig/osmo-msc_multi-cs7.cfg6emqv8r2
build     9411  0.0  0.0   4280   708 ?        S    06:28   0:00 /bin/sh -c ps xua | grep osmo
build     9413  0.0  0.0  12784   988 ?        S    06:28   0:00 grep osmo

Socket: in 1 tries, connected to 127.0.0.1:4254 <socket.socket fd=4, family=AddressFamily.AF_INET, type=SocketKind.SOCK_STREAM, proto=0, laddr=('127.0.0.1', 51300), raddr=('127.0.0.1', 4254)> (1 sockets open)
Terminating took 0.897s
Socket: closing 127.0.0.1:4254 <socket.socket fd=4, family=AddressFamily.AF_INET, type=SocketKind.SOCK_STREAM, proto=0, laddr=('127.0.0.1', 51300), raddr=('127.0.0.1', 4254)> (0 sockets open)
Verifying src/osmo-msc/osmo-msc -c /build/writtenconfig/osmo-msc_multi-cs7.cfg6emqv8r2, test token_vty_command
Launching: PWD=/build 'src/osmo-msc/osmo-msc' '-c' '/build/writtenconfig/osmo-msc_multi-cs7.cfg6emqv8r2'

> ls -l /proc/9326/fd
total 0
lr-x------ 1 build build 64 Aug 18 06:28 0 -> pipe:[470516059]
l-wx------ 1 build build 64 Aug 18 06:28 1 -> pipe:[470516060]
l-wx------ 1 build build 64 Aug 18 06:28 2 -> pipe:[470516061]
l-wx------ 1 build build 64 Aug 18 06:28 3 -> /dev/null


> ss -tn
State      Recv-Q Send-Q Local Address:Port               Peer Address:Port              


> ss -tln
State      Recv-Q Send-Q Local Address:Port               Peer Address:Port              


> ps xua | grep osmo
build     9326  1.4  0.0  54356 21436 ?        S    06:28   0:00 /usr/bin/python3 /usr/local/bin/osmotestconfig.py -p /build -w /build -v
build     9415  0.0  0.0 21474989712 25200 ?   R    06:28   0:00 src/osmo-msc/osmo-msc -c /build/writtenconfig/osmo-msc_multi-cs7.cfg6emqv8r2
build     9422  0.0  0.0   4280   696 ?        S    06:28   0:00 /bin/sh -c ps xua | grep osmo
build     9424  0.0  0.0  12784   972 ?        S    06:28   0:00 grep osmo

Connecting socket failed, retrying...
Socket: in 2 tries, connected to 127.0.0.1:4254 <socket.socket fd=5, family=AddressFamily.AF_INET, type=SocketKind.SOCK_STREAM, proto=0, laddr=('127.0.0.1', 51310), raddr=('127.0.0.1', 4254)> (1 sockets open)
Terminating took 0.897s
Socket: closing 127.0.0.1:4254 <socket.socket fd=5, family=AddressFamily.AF_INET, type=SocketKind.SOCK_STREAM, proto=0, laddr=('127.0.0.1', 51310), raddr=('127.0.0.1', 4254)> (0 sockets open)
ERRORS: 3
make[7]: *** [vty-python-test] Error 3
Makefile:718: recipe for target 'vty-python-test' failed
make[7]: Leaving directory '/build/tests'
Makefile:740: recipe for target 'vty-test' failed
make[6]: Leaving directory '/build/tests'
make[6]: *** [vty-test] Error 2
Makefile:710: recipe for target 'python-tests' failed
make[5]: Leaving directory '/build/tests'
make[5]: *** [python-tests] Error 2
Makefile:763: recipe for target 'check-local' failed
make[4]: *** [check-local] Error 2
make[4]: Leaving directory '/build/tests'
make[3]: *** [check-am] Error 2
Makefile:569: recipe for target 'check-am' failed
make[3]: Leaving directory '/build/tests'
make[2]: *** [check-recursive] Error 1
Makefile:421: recipe for target 'check-recursive' failed
make[2]: Leaving directory '/build/tests'
make[1]: *** [check-recursive] Error 1
Makefile:469: recipe for target 'check-recursive' failed
make[1]: Leaving directory '/build'
make: *** [check] Error 2
Makefile:760: recipe for target 'check' failed
+ cat-testlogs.sh
Build step 'Execute shell' marked build as failure
[WARNINGS]Skipping publisher since build result is FAILURE


More information about the jenkins-notifications mailing list