Build failed in Jenkins: master-osmo-msc » --enable-iu,0,a3=default,a4=default,osmocom-master-debian9 #25993

jenkins at lists.osmocom.org jenkins at lists.osmocom.org
Wed Aug 18 06:23:45 UTC 2021


See <https://jenkins.osmocom.org/jenkins/job/master-osmo-msc/IU=--enable-iu,WITH_MANUALS=0,a3=default,a4=default,label=osmocom-master-debian9/25993/display/redirect>

Changes:


------------------------------------------
[...truncated 800.32 KB...]

> ss -tn
State      Recv-Q Send-Q Local Address:Port               Peer Address:Port              


> ss -tln
State      Recv-Q Send-Q Local Address:Port               Peer Address:Port              


> ps xua | grep osmo
build     9335  6.5  0.0  54340 21356 ?        S    06:23   0:00 /usr/bin/python3 /usr/local/bin/osmotestconfig.py -p /build -w /build -v
build     9347  0.0  0.0 21474991860 25732 ?   R    06:23   0:00 src/osmo-msc/osmo-msc -c /build/writtenconfig/osmo-msc.cfgrfbbyilz
build     9354  0.0  0.0   4280   708 ?        S    06:23   0:00 /bin/sh -c ps xua | grep osmo
build     9356  0.0  0.0  12784   968 ?        S    06:23   0:00 grep osmo

Socket: in 1 tries, connected to 127.0.0.1:4254 <socket.socket fd=4, family=AddressFamily.AF_INET, type=SocketKind.SOCK_STREAM, proto=0, laddr=('127.0.0.1', 50796), raddr=('127.0.0.1', 4254)> (1 sockets open)
Terminating took 0.897s
Socket: closing 127.0.0.1:4254 <socket.socket fd=4, family=AddressFamily.AF_INET, type=SocketKind.SOCK_STREAM, proto=0, laddr=('127.0.0.1', 50796), raddr=('127.0.0.1', 4254)> (0 sockets open)
Verifying src/osmo-msc/osmo-msc -c /build/writtenconfig/osmo-msc.cfgrfbbyilz, test token_vty_command
Launching: PWD=/build 'src/osmo-msc/osmo-msc' '-c' '/build/writtenconfig/osmo-msc.cfgrfbbyilz'

> ls -l /proc/9335/fd
total 0
lr-x------ 1 build build 64 Aug 18 06:23 0 -> pipe:[469703793]
l-wx------ 1 build build 64 Aug 18 06:23 1 -> pipe:[469703794]
l-wx------ 1 build build 64 Aug 18 06:23 2 -> pipe:[469703795]
l-wx------ 1 build build 64 Aug 18 06:23 3 -> /dev/null


> ss -tn
State      Recv-Q Send-Q Local Address:Port               Peer Address:Port              


> ss -tln
State      Recv-Q Send-Q Local Address:Port               Peer Address:Port              


> ps xua | grep osmo
build     9335  2.1  0.0  54340 21356 ?        S    06:23   0:00 /usr/bin/python3 /usr/local/bin/osmotestconfig.py -p /build -w /build -v
build     9358  0.0  0.0 21474989712 25272 ?   R    06:23   0:00 src/osmo-msc/osmo-msc -c /build/writtenconfig/osmo-msc.cfgrfbbyilz
build     9365  0.0  0.0   4280   700 ?        S    06:23   0:00 /bin/sh -c ps xua | grep osmo
build     9367  0.0  0.0  12784   972 ?        S    06:23   0:00 grep osmo

Socket: in 1 tries, connected to 127.0.0.1:4254 <socket.socket fd=4, family=AddressFamily.AF_INET, type=SocketKind.SOCK_STREAM, proto=0, laddr=('127.0.0.1', 50804), raddr=('127.0.0.1', 4254)> (1 sockets open)
Terminating took 0.897s
Socket: closing 127.0.0.1:4254 <socket.socket fd=4, family=AddressFamily.AF_INET, type=SocketKind.SOCK_STREAM, proto=0, laddr=('127.0.0.1', 50804), raddr=('127.0.0.1', 4254)> (0 sockets open)
Verifying src/osmo-msc/osmo-msc -c /build/doc/examples/osmo-msc/osmo-msc_custom-sccp.cfg, test verify_doc
Launching: PWD=/build 'src/osmo-msc/osmo-msc' '-c' '/build/doc/examples/osmo-msc/osmo-msc_custom-sccp.cfg'

> ls -l /proc/9335/fd
total 0
lr-x------ 1 build build 64 Aug 18 06:23 0 -> pipe:[469703793]
l-wx------ 1 build build 64 Aug 18 06:23 1 -> pipe:[469703794]
l-wx------ 1 build build 64 Aug 18 06:23 2 -> pipe:[469703795]
l-wx------ 1 build build 64 Aug 18 06:23 3 -> /dev/null


> ss -tn
State      Recv-Q Send-Q Local Address:Port               Peer Address:Port              


> ss -tln
State      Recv-Q Send-Q Local Address:Port               Peer Address:Port              


> ps xua | grep osmo
build     9335  1.6  0.0  54340 21356 ?        S    06:23   0:00 /usr/bin/python3 /usr/local/bin/osmotestconfig.py -p /build -w /build -v
build     9369  0.0  0.0 21474995340 27648 ?   D    06:23   0:00 src/osmo-msc/osmo-msc -c /build/doc/examples/osmo-msc/osmo-msc_custom-sccp.cfg
build     9376  0.0  0.0   4280   736 ?        S    06:23   0:00 /bin/sh -c ps xua | grep osmo
build     9378  0.0  0.0  12784   972 ?        S    06:23   0:00 grep osmo

Socket: in 1 tries, connected to 127.0.0.1:4254 <socket.socket fd=4, family=AddressFamily.AF_INET, type=SocketKind.SOCK_STREAM, proto=0, laddr=('127.0.0.1', 50818), raddr=('127.0.0.1', 4254)> (1 sockets open)
Terminating took 0.897s
Socket: closing 127.0.0.1:4254 <socket.socket fd=4, family=AddressFamily.AF_INET, type=SocketKind.SOCK_STREAM, proto=0, laddr=('127.0.0.1', 50818), raddr=('127.0.0.1', 4254)> (0 sockets open)
Verifying src/osmo-msc/osmo-msc -c /build/writtenconfig/osmo-msc_custom-sccp.cfgncor_lj4, test write_config
Launching: PWD=/build 'src/osmo-msc/osmo-msc' '-c' '/build/writtenconfig/osmo-msc_custom-sccp.cfgncor_lj4'

> ls -l /proc/9335/fd
total 0
lr-x------ 1 build build 64 Aug 18 06:23 0 -> pipe:[469703793]
l-wx------ 1 build build 64 Aug 18 06:23 1 -> pipe:[469703794]
l-wx------ 1 build build 64 Aug 18 06:23 2 -> pipe:[469703795]
l-wx------ 1 build build 64 Aug 18 06:23 3 -> /dev/null
Documentation error (missing docs): 
<command id='no mgw reset-endpoint NAME'>
        <param name='NAME' doc='(null)' />



> ss -tn
State      Recv-Q Send-Q Local Address:Port               Peer Address:Port              


> ss -tln
State      Recv-Q Send-Q Local Address:Port               Peer Address:Port              


> ps xua | grep osmo
build     9335  1.5  0.0  54340 21376 ?        S    06:23   0:00 /usr/bin/python3 /usr/local/bin/osmotestconfig.py -p /build -w /build -v
build     9380  0.0  0.0 21474995340 27456 ?   D    06:23   0:00 src/osmo-msc/osmo-msc -c /build/writtenconfig/osmo-msc_custom-sccp.cfgncor_lj4
build     9387  0.0  0.0   4280   732 ?        S    06:23   0:00 /bin/sh -c ps xua | grep osmo
build     9389  0.0  0.0  12784   972 ?        R    06:23   0:00 grep osmo

Socket: in 1 tries, connected to 127.0.0.1:4254 <socket.socket fd=4, family=AddressFamily.AF_INET, type=SocketKind.SOCK_STREAM, proto=0, laddr=('127.0.0.1', 50828), raddr=('127.0.0.1', 4254)> (1 sockets open)
Terminating took 0.475s
Socket: closing 127.0.0.1:4254 <socket.socket fd=4, family=AddressFamily.AF_INET, type=SocketKind.SOCK_STREAM, proto=0, laddr=('127.0.0.1', 50828), raddr=('127.0.0.1', 4254)> (0 sockets open)
Verifying src/osmo-msc/osmo-msc -c /build/writtenconfig/osmo-msc_custom-sccp.cfgncor_lj4, test token_vty_command
Launching: PWD=/build 'src/osmo-msc/osmo-msc' '-c' '/build/writtenconfig/osmo-msc_custom-sccp.cfgncor_lj4'

> ls -l /proc/9335/fd
total 0
lr-x------ 1 build build 64 Aug 18 06:23 0 -> pipe:[469703793]
l-wx------ 1 build build 64 Aug 18 06:23 1 -> pipe:[469703794]
l-wx------ 1 build build 64 Aug 18 06:23 2 -> pipe:[469703795]
l-wx------ 1 build build 64 Aug 18 06:23 3 -> /dev/null


> ss -tn
State      Recv-Q Send-Q Local Address:Port               Peer Address:Port              


> ss -tln
State      Recv-Q Send-Q Local Address:Port               Peer Address:Port              


> ps xua | grep osmo
build     9335  1.3  0.0  54340 21376 ?        S    06:23   0:00 /usr/bin/python3 /usr/local/bin/osmotestconfig.py -p /build -w /build -v
build     9391  0.0  0.0 21474995340 27868 ?   D    06:23   0:00 src/osmo-msc/osmo-msc -c /build/writtenconfig/osmo-msc_custom-sccp.cfgncor_lj4
build     9398  0.0  0.0   4280   724 ?        S    06:23   0:00 /bin/sh -c ps xua | grep osmo
build     9400  0.0  0.0  12784  1028 ?        S    06:23   0:00 grep osmo

Socket: in 1 tries, connected to 127.0.0.1:4254 <socket.socket fd=4, family=AddressFamily.AF_INET, type=SocketKind.SOCK_STREAM, proto=0, laddr=('127.0.0.1', 50830), raddr=('127.0.0.1', 4254)> (1 sockets open)
Terminating took 0.897s
Socket: closing 127.0.0.1:4254 <socket.socket fd=4, family=AddressFamily.AF_INET, type=SocketKind.SOCK_STREAM, proto=0, laddr=('127.0.0.1', 50830), raddr=('127.0.0.1', 4254)> (0 sockets open)
Verifying src/osmo-msc/osmo-msc -c /build/doc/examples/osmo-msc/osmo-msc_multi-cs7.cfg, test verify_doc
Launching: PWD=/build 'src/osmo-msc/osmo-msc' '-c' '/build/doc/examples/osmo-msc/osmo-msc_multi-cs7.cfg'

> ls -l /proc/9335/fd
total 0
lr-x------ 1 build build 64 Aug 18 06:23 0 -> pipe:[469703793]
l-wx------ 1 build build 64 Aug 18 06:23 1 -> pipe:[469703794]
l-wx------ 1 build build 64 Aug 18 06:23 2 -> pipe:[469703795]
l-wx------ 1 build build 64 Aug 18 06:23 3 -> /dev/null


> ss -tn
State      Recv-Q Send-Q Local Address:Port               Peer Address:Port              


> ss -tln
State      Recv-Q Send-Q Local Address:Port               Peer Address:Port              


> ps xua | grep osmo
build     9335  1.1  0.0  54340 21376 ?        S    06:23   0:00 /usr/bin/python3 /usr/local/bin/osmotestconfig.py -p /build -w /build -v
build     9402  0.0  0.0 21474995340 27344 ?   R    06:23   0:00 src/osmo-msc/osmo-msc -c /build/doc/examples/osmo-msc/osmo-msc_multi-cs7.cfg
build     9409  0.0  0.0   4280   696 ?        S    06:23   0:00 /bin/sh -c ps xua | grep osmo
build     9411  0.0  0.0  12784   980 ?        S    06:23   0:00 grep osmo

Socket: in 1 tries, connected to 127.0.0.1:4254 <socket.socket fd=4, family=AddressFamily.AF_INET, type=SocketKind.SOCK_STREAM, proto=0, laddr=('127.0.0.1', 50836), raddr=('127.0.0.1', 4254)> (1 sockets open)
Terminating took 0.897s
Socket: closing 127.0.0.1:4254 <socket.socket fd=4, family=AddressFamily.AF_INET, type=SocketKind.SOCK_STREAM, proto=0, laddr=('127.0.0.1', 50836), raddr=('127.0.0.1', 4254)> (0 sockets open)
Verifying src/osmo-msc/osmo-msc -c /build/writtenconfig/osmo-msc_multi-cs7.cfg2s_0wwl0, test write_config
Launching: PWD=/build 'src/osmo-msc/osmo-msc' '-c' '/build/writtenconfig/osmo-msc_multi-cs7.cfg2s_0wwl0'

> ls -l /proc/9335/fd
total 0
lr-x------ 1 build build 64 Aug 18 06:23 0 -> pipe:[469703793]
l-wx------ 1 build build 64 Aug 18 06:23 1 -> pipe:[469703794]
l-wx------ 1 build build 64 Aug 18 06:23 2 -> pipe:[469703795]
l-wx------ 1 build build 64 Aug 18 06:23 3 -> /dev/null


> ss -tn
Documentation error (missing docs): 
<command id='no mgw reset-endpoint NAME'>
        <param name='NAME' doc='(null)' />

State      Recv-Q Send-Q Local Address:Port               Peer Address:Port              


> ss -tln
State      Recv-Q Send-Q Local Address:Port               Peer Address:Port              


> ps xua | grep osmo
build     9335  1.1  0.0  54340 21376 ?        S    06:23   0:00 /usr/bin/python3 /usr/local/bin/osmotestconfig.py -p /build -w /build -v
build     9413  0.0  0.0 21474995340 27684 ?   R    06:23   0:00 src/osmo-msc/osmo-msc -c /build/writtenconfig/osmo-msc_multi-cs7.cfg2s_0wwl0
build     9420  0.0  0.0   4280   732 ?        S    06:23   0:00 /bin/sh -c ps xua | grep osmo
build     9422  0.0  0.0  12784   976 ?        S    06:23   0:00 grep osmo

Socket: in 1 tries, connected to 127.0.0.1:4254 <socket.socket fd=4, family=AddressFamily.AF_INET, type=SocketKind.SOCK_STREAM, proto=0, laddr=('127.0.0.1', 50840), raddr=('127.0.0.1', 4254)> (1 sockets open)
Terminating took 0.897s
Socket: closing 127.0.0.1:4254 <socket.socket fd=4, family=AddressFamily.AF_INET, type=SocketKind.SOCK_STREAM, proto=0, laddr=('127.0.0.1', 50840), raddr=('127.0.0.1', 4254)> (0 sockets open)
Verifying src/osmo-msc/osmo-msc -c /build/writtenconfig/osmo-msc_multi-cs7.cfg2s_0wwl0, test token_vty_command
Launching: PWD=/build 'src/osmo-msc/osmo-msc' '-c' '/build/writtenconfig/osmo-msc_multi-cs7.cfg2s_0wwl0'

> ls -l /proc/9335/fd
total 0
lr-x------ 1 build build 64 Aug 18 06:23 0 -> pipe:[469703793]
l-wx------ 1 build build 64 Aug 18 06:23 1 -> pipe:[469703794]
l-wx------ 1 build build 64 Aug 18 06:23 2 -> pipe:[469703795]
l-wx------ 1 build build 64 Aug 18 06:23 3 -> /dev/null


> ss -tn
State      Recv-Q Send-Q Local Address:Port               Peer Address:Port              


> ss -tln
State      Recv-Q Send-Q Local Address:Port               Peer Address:Port              


> ps xua | grep osmo
build     9335  1.0  0.0  54340 21376 ?        S    06:23   0:00 /usr/bin/python3 /usr/local/bin/osmotestconfig.py -p /build -w /build -v
build     9424  0.0  0.0 21474995340 27848 ?   D    06:23   0:00 src/osmo-msc/osmo-msc -c /build/writtenconfig/osmo-msc_multi-cs7.cfg2s_0wwl0
build     9431  0.0  0.0   4280   712 ?        S    06:23   0:00 /bin/sh -c ps xua | grep osmo
build     9433  0.0  0.0  12784   980 ?        S    06:23   0:00 grep osmo

ERRORS: 3
Socket: in 1 tries, connected to 127.0.0.1:4254 <socket.socket fd=4, family=AddressFamily.AF_INET, type=SocketKind.SOCK_STREAM, proto=0, laddr=('127.0.0.1', 50842), raddr=('127.0.0.1', 4254)> (1 sockets open)
Terminating took 0.897s
Socket: closing 127.0.0.1:4254 <socket.socket fd=4, family=AddressFamily.AF_INET, type=SocketKind.SOCK_STREAM, proto=0, laddr=('127.0.0.1', 50842), raddr=('127.0.0.1', 4254)> (0 sockets open)
make[7]: *** [vty-python-test] Error 3
Makefile:718: recipe for target 'vty-python-test' failed
make[7]: Leaving directory '/build/tests'
make[6]: *** [vty-test] Error 2
Makefile:740: recipe for target 'vty-test' failed
make[6]: Leaving directory '/build/tests'
make[5]: *** [python-tests] Error 2
Makefile:710: recipe for target 'python-tests' failed
make[5]: Leaving directory '/build/tests'
make[4]: *** [check-local] Error 2
Makefile:763: recipe for target 'check-local' failed
make[4]: Leaving directory '/build/tests'
Makefile:569: recipe for target 'check-am' failed
make[3]: Leaving directory '/build/tests'
make[3]: *** [check-am] Error 2
make[2]: *** [check-recursive] Error 1
Makefile:421: recipe for target 'check-recursive' failed
make[2]: Leaving directory '/build/tests'
make[1]: *** [check-recursive] Error 1
Makefile:469: recipe for target 'check-recursive' failed
make[1]: Leaving directory '/build'
Makefile:760: recipe for target 'check' failed
make: *** [check] Error 2
+ cat-testlogs.sh
Build step 'Execute shell' marked build as failure
[WARNINGS]Skipping publisher since build result is FAILURE


More information about the jenkins-notifications mailing list