Build failed in Jenkins: master-osmo-msc » --enable-iu,0,a3=default,a4=default,osmocom-master-debian9 #25990

jenkins at lists.osmocom.org jenkins at lists.osmocom.org
Wed Aug 18 01:01:13 UTC 2021


See <https://jenkins.osmocom.org/jenkins/job/master-osmo-msc/IU=--enable-iu,WITH_MANUALS=0,a3=default,a4=default,label=osmocom-master-debian9/25990/display/redirect>

Changes:


------------------------------------------
[...truncated 801.33 KB...]
build     9096  8.5  0.0  54336 21484 ?        S    01:00   0:00 /usr/bin/python3 /usr/local/bin/osmotestconfig.py -p /build -w /build -v
build     9108  0.0  0.0 21474995340 27432 ?   D    01:00   0:00 src/osmo-msc/osmo-msc -c /build/writtenconfig/osmo-msc.cfgbfd4xgf0
build     9115  0.0  0.0   4280   708 ?        S    01:00   0:00 /bin/sh -c ps xua | grep osmo
build     9117  0.0  0.0  12784   992 ?        S    01:00   0:00 grep osmo

Socket: in 1 tries, connected to 127.0.0.1:4254 <socket.socket fd=4, family=AddressFamily.AF_INET, type=SocketKind.SOCK_STREAM, proto=0, laddr=('127.0.0.1', 41836), raddr=('127.0.0.1', 4254)> (1 sockets open)
Terminating took 0.168s
Socket: closing 127.0.0.1:4254 <socket.socket fd=4, family=AddressFamily.AF_INET, type=SocketKind.SOCK_STREAM, proto=0, laddr=('127.0.0.1', 41836), raddr=('127.0.0.1', 4254)> (0 sockets open)
Verifying src/osmo-msc/osmo-msc -c /build/writtenconfig/osmo-msc.cfgbfd4xgf0, test token_vty_command
Launching: PWD=/build 'src/osmo-msc/osmo-msc' '-c' '/build/writtenconfig/osmo-msc.cfgbfd4xgf0'

> ls -l /proc/9096/fd
total 0
lr-x------ 1 build build 64 Aug 18 01:00 0 -> pipe:[466333924]
l-wx------ 1 build build 64 Aug 18 01:00 1 -> pipe:[466333925]
l-wx------ 1 build build 64 Aug 18 01:00 2 -> pipe:[466333926]
l-wx------ 1 build build 64 Aug 18 01:00 3 -> /dev/null


> ss -tn
State      Recv-Q Send-Q Local Address:Port               Peer Address:Port              


> ss -tln
State      Recv-Q Send-Q Local Address:Port               Peer Address:Port              
LISTEN     0      10           *:2775                     *:*                  
LISTEN     0      10     127.0.0.1:4254                     *:*                  
LISTEN     0      10     127.0.0.1:4255                     *:*                  


> ps xua | grep osmo
build     9096  6.0  0.0  54336 21484 ?        S    01:00   0:00 /usr/bin/python3 /usr/local/bin/osmotestconfig.py -p /build -w /build -v
build     9119  0.0  0.0 21474995340 27704 ?   D    01:01   0:00 src/osmo-msc/osmo-msc -c /build/writtenconfig/osmo-msc.cfgbfd4xgf0
build     9126  0.0  0.0   4280   760 ?        S    01:01   0:00 /bin/sh -c ps xua | grep osmo
build     9128  0.0  0.0  12784   992 ?        S    01:01   0:00 grep osmo

Socket: in 1 tries, connected to 127.0.0.1:4254 <socket.socket fd=4, family=AddressFamily.AF_INET, type=SocketKind.SOCK_STREAM, proto=0, laddr=('127.0.0.1', 41838), raddr=('127.0.0.1', 4254)> (1 sockets open)
Terminating took 0.897s
Socket: closing 127.0.0.1:4254 <socket.socket fd=4, family=AddressFamily.AF_INET, type=SocketKind.SOCK_STREAM, proto=0, laddr=('127.0.0.1', 41838), raddr=('127.0.0.1', 4254)> (0 sockets open)
Verifying src/osmo-msc/osmo-msc -c /build/doc/examples/osmo-msc/osmo-msc_custom-sccp.cfg, test verify_doc
Launching: PWD=/build 'src/osmo-msc/osmo-msc' '-c' '/build/doc/examples/osmo-msc/osmo-msc_custom-sccp.cfg'

> ls -l /proc/9096/fd
total 0
lr-x------ 1 build build 64 Aug 18 01:00 0 -> pipe:[466333924]
l-wx------ 1 build build 64 Aug 18 01:00 1 -> pipe:[466333925]
l-wx------ 1 build build 64 Aug 18 01:00 2 -> pipe:[466333926]
l-wx------ 1 build build 64 Aug 18 01:00 3 -> /dev/null


> ss -tn
State      Recv-Q Send-Q Local Address:Port               Peer Address:Port              


> ss -tln
State      Recv-Q Send-Q Local Address:Port               Peer Address:Port              
LISTEN     0      10           *:2775                     *:*                  
LISTEN     0      10     127.0.0.1:4254                     *:*                  
LISTEN     0      10     127.0.0.1:4255                     *:*                  


> ps xua | grep osmo
build     9096  3.6  0.0  54336 21484 ?        S    01:00   0:00 /usr/bin/python3 /usr/local/bin/osmotestconfig.py -p /build -w /build -v
build     9130  0.0  0.0 21474995340 27548 ?   D    01:01   0:00 src/osmo-msc/osmo-msc -c /build/doc/examples/osmo-msc/osmo-msc_custom-sccp.cfg
build     9137  0.0  0.0   4280   708 ?        S    01:01   0:00 /bin/sh -c ps xua | grep osmo
build     9139  0.0  0.0   4280    88 ?        R    01:01   0:00 /bin/sh -c ps xua | grep osmo

Socket: in 1 tries, connected to 127.0.0.1:4254 <socket.socket fd=4, family=AddressFamily.AF_INET, type=SocketKind.SOCK_STREAM, proto=0, laddr=('127.0.0.1', 41840), raddr=('127.0.0.1', 4254)> (1 sockets open)
Terminating took 0.897s
Socket: closing 127.0.0.1:4254 <socket.socket fd=4, family=AddressFamily.AF_INET, type=SocketKind.SOCK_STREAM, proto=0, laddr=('127.0.0.1', 41840), raddr=('127.0.0.1', 4254)> (0 sockets open)
Verifying src/osmo-msc/osmo-msc -c /build/writtenconfig/osmo-msc_custom-sccp.cfg9t_1dfm1, test write_config
Launching: PWD=/build 'src/osmo-msc/osmo-msc' '-c' '/build/writtenconfig/osmo-msc_custom-sccp.cfg9t_1dfm1'

> ls -l /proc/9096/fd
total 0
lr-x------ 1 build build 64 Aug 18 01:00 0 -> pipe:[466333924]
l-wx------ 1 build build 64 Aug 18 01:00 1 -> pipe:[466333925]
l-wx------ 1 build build 64 Aug 18 01:00 2 -> pipe:[466333926]
l-wx------ 1 build build 64 Aug 18 01:00 3 -> /dev/null
Documentation error (missing docs): 
<command id='no mgw reset-endpoint NAME'>
        <param name='NAME' doc='(null)' />



> ss -tn
State      Recv-Q Send-Q Local Address:Port               Peer Address:Port              


> ss -tln
State      Recv-Q Send-Q Local Address:Port               Peer Address:Port              


> ps xua | grep osmo
build     9096  3.1  0.0  54336 21492 ?        S    01:00   0:00 /usr/bin/python3 /usr/local/bin/osmotestconfig.py -p /build -w /build -v
build     9141  0.0  0.0 21474995340 27612 ?   D    01:01   0:00 src/osmo-msc/osmo-msc -c /build/writtenconfig/osmo-msc_custom-sccp.cfg9t_1dfm1
build     9148  0.0  0.0   4280   748 ?        S    01:01   0:00 /bin/sh -c ps xua | grep osmo
build     9150  0.0  0.0  12784   956 ?        S    01:01   0:00 grep osmo

Socket: in 1 tries, connected to 127.0.0.1:4254 <socket.socket fd=4, family=AddressFamily.AF_INET, type=SocketKind.SOCK_STREAM, proto=0, laddr=('127.0.0.1', 41842), raddr=('127.0.0.1', 4254)> (1 sockets open)
Terminating took 0.475s
Socket: closing 127.0.0.1:4254 <socket.socket fd=4, family=AddressFamily.AF_INET, type=SocketKind.SOCK_STREAM, proto=0, laddr=('127.0.0.1', 41842), raddr=('127.0.0.1', 4254)> (0 sockets open)
Verifying src/osmo-msc/osmo-msc -c /build/writtenconfig/osmo-msc_custom-sccp.cfg9t_1dfm1, test token_vty_command
Launching: PWD=/build 'src/osmo-msc/osmo-msc' '-c' '/build/writtenconfig/osmo-msc_custom-sccp.cfg9t_1dfm1'

> ls -l /proc/9096/fd
total 0
lr-x------ 1 build build 64 Aug 18 01:00 0 -> pipe:[466333924]
l-wx------ 1 build build 64 Aug 18 01:00 1 -> pipe:[466333925]
l-wx------ 1 build build 64 Aug 18 01:00 2 -> pipe:[466333926]
l-wx------ 1 build build 64 Aug 18 01:00 3 -> /dev/null


> ss -tn
State      Recv-Q Send-Q Local Address:Port               Peer Address:Port              


> ss -tln
State      Recv-Q Send-Q Local Address:Port               Peer Address:Port              
LISTEN     0      10           *:2775                     *:*                  
LISTEN     0      10     127.0.0.1:4254                     *:*                  
LISTEN     0      10     127.0.0.1:4255                     *:*                  


> ps xua | grep osmo
build     9096  2.5  0.0  54336 21492 ?        S    01:00   0:00 /usr/bin/python3 /usr/local/bin/osmotestconfig.py -p /build -w /build -v
build     9152  0.0  0.0 21474995340 27744 ?   D    01:01   0:00 src/osmo-msc/osmo-msc -c /build/writtenconfig/osmo-msc_custom-sccp.cfg9t_1dfm1
build     9159  0.0  0.0   4280   796 ?        S    01:01   0:00 /bin/sh -c ps xua | grep osmo
build     9161  0.0  0.0  12784   964 ?        S    01:01   0:00 grep osmo

Socket: in 1 tries, connected to 127.0.0.1:4254 <socket.socket fd=4, family=AddressFamily.AF_INET, type=SocketKind.SOCK_STREAM, proto=0, laddr=('127.0.0.1', 41844), raddr=('127.0.0.1', 4254)> (1 sockets open)
Terminating took 0.897s
Socket: closing 127.0.0.1:4254 <socket.socket fd=4, family=AddressFamily.AF_INET, type=SocketKind.SOCK_STREAM, proto=0, laddr=('127.0.0.1', 41844), raddr=('127.0.0.1', 4254)> (0 sockets open)
Verifying src/osmo-msc/osmo-msc -c /build/doc/examples/osmo-msc/osmo-msc_multi-cs7.cfg, test verify_doc
Launching: PWD=/build 'src/osmo-msc/osmo-msc' '-c' '/build/doc/examples/osmo-msc/osmo-msc_multi-cs7.cfg'

> ls -l /proc/9096/fd
total 0
lr-x------ 1 build build 64 Aug 18 01:00 0 -> pipe:[466333924]
l-wx------ 1 build build 64 Aug 18 01:00 1 -> pipe:[466333925]
l-wx------ 1 build build 64 Aug 18 01:00 2 -> pipe:[466333926]
l-wx------ 1 build build 64 Aug 18 01:00 3 -> /dev/null


> ss -tn
State      Recv-Q Send-Q Local Address:Port               Peer Address:Port              


> ss -tln
State      Recv-Q Send-Q Local Address:Port               Peer Address:Port              


> ps xua | grep osmo
build     9096  2.2  0.0  54336 21492 ?        S    01:00   0:00 /usr/bin/python3 /usr/local/bin/osmotestconfig.py -p /build -w /build -v
build     9163  0.0  0.0 21474995340 27620 ?   D    01:01   0:00 src/osmo-msc/osmo-msc -c /build/doc/examples/osmo-msc/osmo-msc_multi-cs7.cfg
build     9170  0.0  0.0   4280   696 ?        S    01:01   0:00 /bin/sh -c ps xua | grep osmo
build     9172  0.0  0.0  12784   932 ?        S    01:01   0:00 grep osmo

Socket: in 1 tries, connected to 127.0.0.1:4254 <socket.socket fd=4, family=AddressFamily.AF_INET, type=SocketKind.SOCK_STREAM, proto=0, laddr=('127.0.0.1', 41850), raddr=('127.0.0.1', 4254)> (1 sockets open)
Terminating took 0.897s
Socket: closing 127.0.0.1:4254 <socket.socket fd=4, family=AddressFamily.AF_INET, type=SocketKind.SOCK_STREAM, proto=0, laddr=('127.0.0.1', 41850), raddr=('127.0.0.1', 4254)> (0 sockets open)
Verifying src/osmo-msc/osmo-msc -c /build/writtenconfig/osmo-msc_multi-cs7.cfgu4pm7kq_, test write_config
Launching: PWD=/build 'src/osmo-msc/osmo-msc' '-c' '/build/writtenconfig/osmo-msc_multi-cs7.cfgu4pm7kq_'

> ls -l /proc/9096/fd
total 0
lr-x------ 1 build build 64 Aug 18 01:00 0 -> pipe:[466333924]
l-wx------ 1 build build 64 Aug 18 01:00 1 -> pipe:[466333925]
l-wx------ 1 build build 64 Aug 18 01:00 2 -> pipe:[466333926]
l-wx------ 1 build build 64 Aug 18 01:00 3 -> /dev/null
Documentation error (missing docs): 
<command id='no mgw reset-endpoint NAME'>
        <param name='NAME' doc='(null)' />



> ss -tn
State      Recv-Q Send-Q Local Address:Port               Peer Address:Port              


> ss -tln
State      Recv-Q Send-Q Local Address:Port               Peer Address:Port              


> ps xua | grep osmo
build     9096  1.9  0.0  54336 21508 ?        S    01:00   0:00 /usr/bin/python3 /usr/local/bin/osmotestconfig.py -p /build -w /build -v
build     9174  0.0  0.0 21474989712 25096 ?   R    01:01   0:00 src/osmo-msc/osmo-msc -c /build/writtenconfig/osmo-msc_multi-cs7.cfgu4pm7kq_
build     9181  0.0  0.0   4280   716 ?        S    01:01   0:00 /bin/sh -c ps xua | grep osmo
build     9183  0.0  0.0   4280    88 ?        R    01:01   0:00 /bin/sh -c ps xua | grep osmo

Socket: in 1 tries, connected to 127.0.0.1:4254 <socket.socket fd=4, family=AddressFamily.AF_INET, type=SocketKind.SOCK_STREAM, proto=0, laddr=('127.0.0.1', 41852), raddr=('127.0.0.1', 4254)> (1 sockets open)
Terminating took 0.475s
Socket: closing 127.0.0.1:4254 <socket.socket fd=4, family=AddressFamily.AF_INET, type=SocketKind.SOCK_STREAM, proto=0, laddr=('127.0.0.1', 41852), raddr=('127.0.0.1', 4254)> (0 sockets open)
Verifying src/osmo-msc/osmo-msc -c /build/writtenconfig/osmo-msc_multi-cs7.cfgu4pm7kq_, test token_vty_command
Launching: PWD=/build 'src/osmo-msc/osmo-msc' '-c' '/build/writtenconfig/osmo-msc_multi-cs7.cfgu4pm7kq_'

> ls -l /proc/9096/fd
total 0
lr-x------ 1 build build 64 Aug 18 01:00 0 -> pipe:[466333924]
l-wx------ 1 build build 64 Aug 18 01:00 1 -> pipe:[466333925]
l-wx------ 1 build build 64 Aug 18 01:00 2 -> pipe:[466333926]
l-wx------ 1 build build 64 Aug 18 01:00 3 -> /dev/null


> ss -tn
State      Recv-Q Send-Q Local Address:Port               Peer Address:Port              


> ss -tln
State      Recv-Q Send-Q Local Address:Port               Peer Address:Port              


> ps xua | grep osmo
build     9096  1.6  0.0  54336 21508 ?        S    01:00   0:00 /usr/bin/python3 /usr/local/bin/osmotestconfig.py -p /build -w /build -v
build     9185  0.0  0.0 21474989712 25332 ?   R    01:01   0:00 src/osmo-msc/osmo-msc -c /build/writtenconfig/osmo-msc_multi-cs7.cfgu4pm7kq_
build     9192  0.0  0.0   4280   744 ?        S    01:01   0:00 /bin/sh -c ps xua | grep osmo
build     9194  0.0  0.0  12784   972 ?        S    01:01   0:00 grep osmo

ERRORS: 3
Connecting socket failed, retrying...
Socket: in 2 tries, connected to 127.0.0.1:4254 <socket.socket fd=5, family=AddressFamily.AF_INET, type=SocketKind.SOCK_STREAM, proto=0, laddr=('127.0.0.1', 41856), raddr=('127.0.0.1', 4254)> (1 sockets open)
Terminating took 0.897s
Socket: closing 127.0.0.1:4254 <socket.socket fd=5, family=AddressFamily.AF_INET, type=SocketKind.SOCK_STREAM, proto=0, laddr=('127.0.0.1', 41856), raddr=('127.0.0.1', 4254)> (0 sockets open)
Makefile:718: recipe for target 'vty-python-test' failed
make[7]: Leaving directory '/build/tests'
make[7]: *** [vty-python-test] Error 3
Makefile:740: recipe for target 'vty-test' failed
make[6]: Leaving directory '/build/tests'
make[6]: *** [vty-test] Error 2
Makefile:710: recipe for target 'python-tests' failed
make[5]: Leaving directory '/build/tests'
make[5]: *** [python-tests] Error 2
Makefile:763: recipe for target 'check-local' failed
make[4]: *** [check-local] Error 2
make[4]: Leaving directory '/build/tests'
Makefile:569: recipe for target 'check-am' failed
make[3]: *** [check-am] Error 2
make[3]: Leaving directory '/build/tests'
Makefile:421: recipe for target 'check-recursive' failed
make[2]: Leaving directory '/build/tests'
make[2]: *** [check-recursive] Error 1
Makefile:469: recipe for target 'check-recursive' failed
make[1]: *** [check-recursive] Error 1
make[1]: Leaving directory '/build'
Makefile:760: recipe for target 'check' failed
make: *** [check] Error 2
+ cat-testlogs.sh
Build step 'Execute shell' marked build as failure
[WARNINGS]Skipping publisher since build result is FAILURE


More information about the jenkins-notifications mailing list