Build failed in Jenkins: master-osmo-msc » --enable-iu,0,a3=default,a4=default,osmocom-master-debian9 #25989

jenkins at lists.osmocom.org jenkins at lists.osmocom.org
Wed Aug 18 00:56:48 UTC 2021


See <https://jenkins.osmocom.org/jenkins/job/master-osmo-msc/IU=--enable-iu,WITH_MANUALS=0,a3=default,a4=default,label=osmocom-master-debian9/25989/display/redirect>

Changes:


------------------------------------------
[...truncated 801.13 KB...]

> ps xua | grep osmo
build     9103 13.0  0.0  54260 21092 ?        S    00:56   0:00 /usr/bin/python3 /usr/local/bin/osmotestconfig.py -p /build -w /build -v
build     9115  0.0  0.0 21474995340 27604 ?   D    00:56   0:00 src/osmo-msc/osmo-msc -c /build/writtenconfig/osmo-msc.cfg756dbpfi
build     9122  0.0  0.0   4280   744 ?        S    00:56   0:00 /bin/sh -c ps xua | grep osmo
build     9124  0.0  0.0  12784   948 ?        S    00:56   0:00 grep osmo

Socket: in 1 tries, connected to 127.0.0.1:4254 <socket.socket fd=4, family=AddressFamily.AF_INET, type=SocketKind.SOCK_STREAM, proto=0, laddr=('127.0.0.1', 41248), raddr=('127.0.0.1', 4254)> (1 sockets open)
Terminating took 0.897s
Socket: closing 127.0.0.1:4254 <socket.socket fd=4, family=AddressFamily.AF_INET, type=SocketKind.SOCK_STREAM, proto=0, laddr=('127.0.0.1', 41248), raddr=('127.0.0.1', 4254)> (0 sockets open)
Verifying src/osmo-msc/osmo-msc -c /build/writtenconfig/osmo-msc.cfg756dbpfi, test token_vty_command
Launching: PWD=/build 'src/osmo-msc/osmo-msc' '-c' '/build/writtenconfig/osmo-msc.cfg756dbpfi'

> ls -l /proc/9103/fd
total 0
lr-x------ 1 build build 64 Aug 18 00:56 0 -> pipe:[465498685]
l-wx------ 1 build build 64 Aug 18 00:56 1 -> pipe:[465498686]
l-wx------ 1 build build 64 Aug 18 00:56 2 -> pipe:[465498687]
l-wx------ 1 build build 64 Aug 18 00:56 3 -> /dev/null


> ss -tn
State      Recv-Q Send-Q Local Address:Port               Peer Address:Port              


> ss -tln
State      Recv-Q Send-Q Local Address:Port               Peer Address:Port              
LISTEN     0      10           *:2775                     *:*                  
LISTEN     0      10     127.0.0.1:4254                     *:*                  
LISTEN     0      10     127.0.0.1:4255                     *:*                  


> ps xua | grep osmo
build     9103  2.8  0.0  54260 21092 ?        S    00:56   0:00 /usr/bin/python3 /usr/local/bin/osmotestconfig.py -p /build -w /build -v
build     9126  0.0  0.0 21474995340 27840 ?   D    00:56   0:00 src/osmo-msc/osmo-msc -c /build/writtenconfig/osmo-msc.cfg756dbpfi
build     9133  0.0  0.0   4280   712 ?        S    00:56   0:00 /bin/sh -c ps xua | grep osmo
build     9135  0.0  0.0  12784   988 ?        S    00:56   0:00 grep osmo

Socket: in 1 tries, connected to 127.0.0.1:4254 <socket.socket fd=4, family=AddressFamily.AF_INET, type=SocketKind.SOCK_STREAM, proto=0, laddr=('127.0.0.1', 41260), raddr=('127.0.0.1', 4254)> (1 sockets open)
Terminating took 0.897s
Socket: closing 127.0.0.1:4254 <socket.socket fd=4, family=AddressFamily.AF_INET, type=SocketKind.SOCK_STREAM, proto=0, laddr=('127.0.0.1', 41260), raddr=('127.0.0.1', 4254)> (0 sockets open)
Verifying src/osmo-msc/osmo-msc -c /build/doc/examples/osmo-msc/osmo-msc_custom-sccp.cfg, test verify_doc
Launching: PWD=/build 'src/osmo-msc/osmo-msc' '-c' '/build/doc/examples/osmo-msc/osmo-msc_custom-sccp.cfg'

> ls -l /proc/9103/fd
total 0
lr-x------ 1 build build 64 Aug 18 00:56 0 -> pipe:[465498685]
l-wx------ 1 build build 64 Aug 18 00:56 1 -> pipe:[465498686]
l-wx------ 1 build build 64 Aug 18 00:56 2 -> pipe:[465498687]
l-wx------ 1 build build 64 Aug 18 00:56 3 -> /dev/null


> ss -tn
State      Recv-Q Send-Q Local Address:Port               Peer Address:Port              


> ss -tln
State      Recv-Q Send-Q Local Address:Port               Peer Address:Port              
LISTEN     0      10           *:2775                     *:*                  
LISTEN     0      10     127.0.0.1:4254                     *:*                  
LISTEN     0      10     127.0.0.1:4255                     *:*                  


> ps xua | grep osmo
build     9103  2.0  0.0  54260 21092 ?        S    00:56   0:00 /usr/bin/python3 /usr/local/bin/osmotestconfig.py -p /build -w /build -v
build     9137  0.0  0.0 21474995340 27492 ?   D    00:56   0:00 src/osmo-msc/osmo-msc -c /build/doc/examples/osmo-msc/osmo-msc_custom-sccp.cfg
build     9144  0.0  0.0   4280   752 ?        S    00:56   0:00 /bin/sh -c ps xua | grep osmo
build     9146  0.0  0.0  12784   976 ?        S    00:56   0:00 grep osmo

Socket: in 1 tries, connected to 127.0.0.1:4254 <socket.socket fd=4, family=AddressFamily.AF_INET, type=SocketKind.SOCK_STREAM, proto=0, laddr=('127.0.0.1', 41268), raddr=('127.0.0.1', 4254)> (1 sockets open)
Terminating took 0.897s
Socket: closing 127.0.0.1:4254 <socket.socket fd=4, family=AddressFamily.AF_INET, type=SocketKind.SOCK_STREAM, proto=0, laddr=('127.0.0.1', 41268), raddr=('127.0.0.1', 4254)> (0 sockets open)
Verifying src/osmo-msc/osmo-msc -c /build/writtenconfig/osmo-msc_custom-sccp.cfguydke495, test write_config
Launching: PWD=/build 'src/osmo-msc/osmo-msc' '-c' '/build/writtenconfig/osmo-msc_custom-sccp.cfguydke495'

> ls -l /proc/9103/fd
total 0
lr-x------ 1 build build 64 Aug 18 00:56 0 -> pipe:[465498685]
l-wx------ 1 build build 64 Aug 18 00:56 1 -> pipe:[465498686]
l-wx------ 1 build build 64 Aug 18 00:56 2 -> pipe:[465498687]
l-wx------ 1 build build 64 Aug 18 00:56 3 -> /dev/null
Documentation error (missing docs): 
<command id='no mgw reset-endpoint NAME'>
        <param name='NAME' doc='(null)' />



> ss -tn
State      Recv-Q Send-Q Local Address:Port               Peer Address:Port              


> ss -tln
State      Recv-Q Send-Q Local Address:Port               Peer Address:Port              


> ps xua | grep osmo
build     9103  1.6  0.0  54260 21104 ?        S    00:56   0:00 /usr/bin/python3 /usr/local/bin/osmotestconfig.py -p /build -w /build -v
build     9148  0.0  0.0 21474989712 23500 ?   R    00:56   0:00 src/osmo-msc/osmo-msc -c /build/writtenconfig/osmo-msc_custom-sccp.cfguydke495
build     9155  0.0  0.0   4280   796 ?        S    00:56   0:00 /bin/sh -c ps xua | grep osmo
build     9157  0.0  0.0  12784   944 ?        S    00:56   0:00 grep osmo

Connecting socket failed, retrying...
Socket: in 2 tries, connected to 127.0.0.1:4254 <socket.socket fd=5, family=AddressFamily.AF_INET, type=SocketKind.SOCK_STREAM, proto=0, laddr=('127.0.0.1', 41284), raddr=('127.0.0.1', 4254)> (1 sockets open)
Terminating took 0.475s
Socket: closing 127.0.0.1:4254 <socket.socket fd=5, family=AddressFamily.AF_INET, type=SocketKind.SOCK_STREAM, proto=0, laddr=('127.0.0.1', 41284), raddr=('127.0.0.1', 4254)> (0 sockets open)
Verifying src/osmo-msc/osmo-msc -c /build/writtenconfig/osmo-msc_custom-sccp.cfguydke495, test token_vty_command
Launching: PWD=/build 'src/osmo-msc/osmo-msc' '-c' '/build/writtenconfig/osmo-msc_custom-sccp.cfguydke495'

> ls -l /proc/9103/fd
total 0
lr-x------ 1 build build 64 Aug 18 00:56 0 -> pipe:[465498685]
l-wx------ 1 build build 64 Aug 18 00:56 1 -> pipe:[465498686]
l-wx------ 1 build build 64 Aug 18 00:56 2 -> pipe:[465498687]
l-wx------ 1 build build 64 Aug 18 00:56 3 -> /dev/null


> ss -tn
State      Recv-Q Send-Q Local Address:Port               Peer Address:Port              


> ss -tln
State      Recv-Q Send-Q Local Address:Port               Peer Address:Port              


> ps xua | grep osmo
build     9103  1.4  0.0  54260 21168 ?        S    00:56   0:00 /usr/bin/python3 /usr/local/bin/osmotestconfig.py -p /build -w /build -v
build     9159  0.0  0.0 21474989712 25128 ?   R    00:56   0:00 src/osmo-msc/osmo-msc -c /build/writtenconfig/osmo-msc_custom-sccp.cfguydke495
build     9166  0.0  0.0   4280   700 ?        S    00:56   0:00 /bin/sh -c ps xua | grep osmo
build     9168  0.0  0.0  12784   904 ?        S    00:56   0:00 grep osmo

Connecting socket failed, retrying...
Socket: in 2 tries, connected to 127.0.0.1:4254 <socket.socket fd=5, family=AddressFamily.AF_INET, type=SocketKind.SOCK_STREAM, proto=0, laddr=('127.0.0.1', 41292), raddr=('127.0.0.1', 4254)> (1 sockets open)
Terminating took 0.897s
Socket: closing 127.0.0.1:4254 <socket.socket fd=5, family=AddressFamily.AF_INET, type=SocketKind.SOCK_STREAM, proto=0, laddr=('127.0.0.1', 41292), raddr=('127.0.0.1', 4254)> (0 sockets open)
Verifying src/osmo-msc/osmo-msc -c /build/doc/examples/osmo-msc/osmo-msc_multi-cs7.cfg, test verify_doc
Launching: PWD=/build 'src/osmo-msc/osmo-msc' '-c' '/build/doc/examples/osmo-msc/osmo-msc_multi-cs7.cfg'

> ls -l /proc/9103/fd
total 0
lr-x------ 1 build build 64 Aug 18 00:56 0 -> pipe:[465498685]
l-wx------ 1 build build 64 Aug 18 00:56 1 -> pipe:[465498686]
l-wx------ 1 build build 64 Aug 18 00:56 2 -> pipe:[465498687]
l-wx------ 1 build build 64 Aug 18 00:56 3 -> /dev/null


> ss -tn
State      Recv-Q Send-Q Local Address:Port               Peer Address:Port              


> ss -tln
State      Recv-Q Send-Q Local Address:Port               Peer Address:Port              


> ps xua | grep osmo
build     9103  1.2  0.0  54260 21168 ?        S    00:56   0:00 /usr/bin/python3 /usr/local/bin/osmotestconfig.py -p /build -w /build -v
build     9170  0.0  0.0 21474995340 27272 ?   R    00:56   0:00 src/osmo-msc/osmo-msc -c /build/doc/examples/osmo-msc/osmo-msc_multi-cs7.cfg
build     9177  0.0  0.0   4280   768 ?        S    00:56   0:00 /bin/sh -c ps xua | grep osmo
build     9179  0.0  0.0  12784   988 ?        S    00:56   0:00 grep osmo

Socket: in 1 tries, connected to 127.0.0.1:4254 <socket.socket fd=4, family=AddressFamily.AF_INET, type=SocketKind.SOCK_STREAM, proto=0, laddr=('127.0.0.1', 41296), raddr=('127.0.0.1', 4254)> (1 sockets open)
Terminating took 0.897s
Socket: closing 127.0.0.1:4254 <socket.socket fd=4, family=AddressFamily.AF_INET, type=SocketKind.SOCK_STREAM, proto=0, laddr=('127.0.0.1', 41296), raddr=('127.0.0.1', 4254)> (0 sockets open)
Verifying src/osmo-msc/osmo-msc -c /build/writtenconfig/osmo-msc_multi-cs7.cfgq2w4djn3, test write_config
Launching: PWD=/build 'src/osmo-msc/osmo-msc' '-c' '/build/writtenconfig/osmo-msc_multi-cs7.cfgq2w4djn3'

> ls -l /proc/9103/fd
total 0
lr-x------ 1 build build 64 Aug 18 00:56 0 -> pipe:[465498685]
l-wx------ 1 build build 64 Aug 18 00:56 1 -> pipe:[465498686]
l-wx------ 1 build build 64 Aug 18 00:56 2 -> pipe:[465498687]
l-wx------ 1 build build 64 Aug 18 00:56 3 -> /dev/null
Documentation error (missing docs): 
<command id='no mgw reset-endpoint NAME'>
        <param name='NAME' doc='(null)' />



> ss -tn
State      Recv-Q Send-Q Local Address:Port               Peer Address:Port              


> ss -tln
State      Recv-Q Send-Q Local Address:Port               Peer Address:Port              


> ps xua | grep osmo
build     9103  1.2  0.0  54260 21176 ?        S    00:56   0:00 /usr/bin/python3 /usr/local/bin/osmotestconfig.py -p /build -w /build -v
build     9181  0.0  0.0 21474995340 27492 ?   D    00:56   0:00 src/osmo-msc/osmo-msc -c /build/writtenconfig/osmo-msc_multi-cs7.cfgq2w4djn3
build     9188  0.0  0.0   4280   748 ?        S    00:56   0:00 /bin/sh -c ps xua | grep osmo
build     9190  0.0  0.0  12784   976 ?        S    00:56   0:00 grep osmo

Socket: in 1 tries, connected to 127.0.0.1:4254 <socket.socket fd=4, family=AddressFamily.AF_INET, type=SocketKind.SOCK_STREAM, proto=0, laddr=('127.0.0.1', 41302), raddr=('127.0.0.1', 4254)> (1 sockets open)
Terminating took 0.168s
Socket: closing 127.0.0.1:4254 <socket.socket fd=4, family=AddressFamily.AF_INET, type=SocketKind.SOCK_STREAM, proto=0, laddr=('127.0.0.1', 41302), raddr=('127.0.0.1', 4254)> (0 sockets open)
Verifying src/osmo-msc/osmo-msc -c /build/writtenconfig/osmo-msc_multi-cs7.cfgq2w4djn3, test token_vty_command
Launching: PWD=/build 'src/osmo-msc/osmo-msc' '-c' '/build/writtenconfig/osmo-msc_multi-cs7.cfgq2w4djn3'

> ls -l /proc/9103/fd
total 0
lr-x------ 1 build build 64 Aug 18 00:56 0 -> pipe:[465498685]
l-wx------ 1 build build 64 Aug 18 00:56 1 -> pipe:[465498686]
l-wx------ 1 build build 64 Aug 18 00:56 2 -> pipe:[465498687]
l-wx------ 1 build build 64 Aug 18 00:56 3 -> /dev/null


> ss -tn
State      Recv-Q Send-Q Local Address:Port               Peer Address:Port              


> ss -tln
State      Recv-Q Send-Q Local Address:Port               Peer Address:Port              


> ps xua | grep osmo
build     9103  1.1  0.0  54260 21176 ?        S    00:56   0:00 /usr/bin/python3 /usr/local/bin/osmotestconfig.py -p /build -w /build -v
build     9192  0.0  0.0 21474989712 26024 ?   R    00:56   0:00 src/osmo-msc/osmo-msc -c /build/writtenconfig/osmo-msc_multi-cs7.cfgq2w4djn3
build     9199  0.0  0.0   4280   720 ?        S    00:56   0:00 /bin/sh -c ps xua | grep osmo
build     9201  0.0  0.0  12784  1024 ?        S    00:56   0:00 grep osmo

ERRORS: 3
Socket: in 1 tries, connected to 127.0.0.1:4254 <socket.socket fd=4, family=AddressFamily.AF_INET, type=SocketKind.SOCK_STREAM, proto=0, laddr=('127.0.0.1', 41308), raddr=('127.0.0.1', 4254)> (1 sockets open)
Terminating took 0.897s
Socket: closing 127.0.0.1:4254 <socket.socket fd=4, family=AddressFamily.AF_INET, type=SocketKind.SOCK_STREAM, proto=0, laddr=('127.0.0.1', 41308), raddr=('127.0.0.1', 4254)> (0 sockets open)
Makefile:718: recipe for target 'vty-python-test' failed
make[7]: Leaving directory '/build/tests'
make[7]: *** [vty-python-test] Error 3
Makefile:740: recipe for target 'vty-test' failed
make[6]: Leaving directory '/build/tests'
make[6]: *** [vty-test] Error 2
Makefile:710: recipe for target 'python-tests' failed
make[5]: Leaving directory '/build/tests'
make[5]: *** [python-tests] Error 2
Makefile:763: recipe for target 'check-local' failed
make[4]: Leaving directory '/build/tests'
make[4]: *** [check-local] Error 2
make[3]: *** [check-am] Error 2
Makefile:569: recipe for target 'check-am' failed
make[3]: Leaving directory '/build/tests'
Makefile:421: recipe for target 'check-recursive' failed
make[2]: Leaving directory '/build/tests'
make[2]: *** [check-recursive] Error 1
make[1]: *** [check-recursive] Error 1
Makefile:469: recipe for target 'check-recursive' failed
make[1]: Leaving directory '/build'
make: *** [check] Error 2
Makefile:760: recipe for target 'check' failed
+ cat-testlogs.sh
Build step 'Execute shell' marked build as failure
[WARNINGS]Skipping publisher since build result is FAILURE


More information about the jenkins-notifications mailing list