Build failed in Jenkins: master-osmo-msc » --disable-iu,1,a3=default,a4=default,osmocom-master-debian9 #25983

jenkins at lists.osmocom.org jenkins at lists.osmocom.org
Tue Aug 17 16:17:05 UTC 2021


See <https://jenkins.osmocom.org/jenkins/job/master-osmo-msc/IU=--disable-iu,WITH_MANUALS=1,a3=default,a4=default,label=osmocom-master-debian9/25983/display/redirect>

Changes:


------------------------------------------
[...truncated 430.55 KB...]
## osmo-msc 1.7.0.20-945b0 test suite. ##
## ----------------------------------- ##

Regression tests.

  1: smpp                                            ok
  2: sms_queue_test                                  ok
  3: db_sms_test                                     ok
  4: msc_vlr_test_no_authen                          ok
  5: msc_vlr_test_gsm_authen                         ok
  6: msc_vlr_test_gsm_ciph                           ok
  7: msc_vlr_test_umts_authen                        ok
  8: msc_vlr_test_authen_reuse                       ok
  9: msc_vlr_test_hlr_reject                         ok
 10: msc_vlr_test_hlr_timeout                        ok
 11: msc_vlr_test_ms_timeout                         ok
 12: msc_vlr_test_reject_concurrency                 ok
 13: msc_vlr_test_call                               ok
 14: msc_vlr_test_rest                               ok
 15: msc_vlr_test_ss                                 ok
 16: sdp_msg_test                                    ok
 17: mncc_test                                       ok

## ------------- ##
## Test results. ##
## ------------- ##

All 17 tests were successful.
make  python-tests
make[5]: Entering directory '/build/tests'
make vty-test
make[6]: Entering directory '/build/tests'
make vty-python-test
make[7]: Entering directory '/build/tests'
IU=0 osmotestvty.py -p /build -w /build -v
test_history (__main__.TestVTY) ... confpath /build, workdir /build
Running tests for specific VTY commands
Launch: ./src/osmo-msc/osmo-msc -c /build/doc/examples/osmo-msc/osmo-msc.cfg from /build
Opening /dev/null
Launching: PWD=/build './src/osmo-msc/osmo-msc' '-c' '/build/doc/examples/osmo-msc/osmo-msc.cfg'

> ls -l /proc/27731/fd
total 0
lr-x------ 1 build build 64 Aug 17 16:16 0 -> pipe:[459305918]
l-wx------ 1 build build 64 Aug 17 16:16 1 -> pipe:[459305919]
l-wx------ 1 build build 64 Aug 17 16:16 2 -> pipe:[459305920]
l-wx------ 1 build build 64 Aug 17 16:16 3 -> /dev/null


> ss -tn
State      Recv-Q Send-Q Local Address:Port               Peer Address:Port              


> ss -tln
State      Recv-Q Send-Q Local Address:Port               Peer Address:Port              


> ps xua | grep osmo
build    27731  0.0  0.0  53724 20684 ?        S    16:16   0:00 /usr/bin/python3 /usr/local/bin/osmotestvty.py -p /build -w /build -v
build    27732  0.0  0.0 21474989440 26160 ?   D    16:16   0:00 ./src/osmo-msc/osmo-msc -c /build/doc/examples/osmo-msc/osmo-msc.cfg
build    27739  0.0  0.0   4280   744 ?        S    16:16   0:00 /bin/sh -c ps xua | grep osmo
build    27741  0.0  0.0  12784  1024 ?        S    16:16   0:00 grep osmo

ok
test_terminal_length (__main__.TestVTY) ... Socket: in 1 tries, connected to 127.0.0.1:4254 <socket.socket fd=4, family=AddressFamily.AF_INET, type=SocketKind.SOCK_STREAM, proto=0, laddr=('127.0.0.1', 58298), raddr=('127.0.0.1', 4254)> (1 sockets open)
Socket: closing 127.0.0.1:4254 <socket.socket fd=4, family=AddressFamily.AF_INET, type=SocketKind.SOCK_STREAM, proto=0, laddr=('127.0.0.1', 58298), raddr=('127.0.0.1', 4254)> (0 sockets open)
Terminating took 0.897s
Launch: ./src/osmo-msc/osmo-msc -c /build/doc/examples/osmo-msc/osmo-msc.cfg from /build
Launching: PWD=/build './src/osmo-msc/osmo-msc' '-c' '/build/doc/examples/osmo-msc/osmo-msc.cfg'

> ls -l /proc/27731/fd
total 0
lr-x------ 1 build build 64 Aug 17 16:16 0 -> pipe:[459305918]
l-wx------ 1 build build 64 Aug 17 16:16 1 -> pipe:[459305919]
l-wx------ 1 build build 64 Aug 17 16:16 2 -> pipe:[459305920]
l-wx------ 1 build build 64 Aug 17 16:16 3 -> /dev/null


> ss -tn
State      Recv-Q Send-Q Local Address:Port               Peer Address:Port              


> ss -tln
State      Recv-Q Send-Q Local Address:Port               Peer Address:Port              


> ps xua | grep osmo
build    27731  7.5  0.0  53724 20772 ?        S    16:16   0:00 /usr/bin/python3 /usr/local/bin/osmotestvty.py -p /build -w /build -v
build    27743  0.0  0.0 21474989440 26280 ?   D    16:16   0:00 ./src/osmo-msc/osmo-msc -c /build/doc/examples/osmo-msc/osmo-msc.cfg
build    27750  0.0  0.0   4280   696 ?        S    16:16   0:00 /bin/sh -c ps xua | grep osmo
build    27752  0.0  0.0  12784   984 ?        R    16:16   0:00 grep osmo

ok
test_unknown_command (__main__.TestVTY) ... Socket: in 1 tries, connected to 127.0.0.1:4254 <socket.socket fd=4, family=AddressFamily.AF_INET, type=SocketKind.SOCK_STREAM, proto=0, laddr=('127.0.0.1', 58300), raddr=('127.0.0.1', 4254)> (1 sockets open)
Socket: closing 127.0.0.1:4254 <socket.socket fd=4, family=AddressFamily.AF_INET, type=SocketKind.SOCK_STREAM, proto=0, laddr=('127.0.0.1', 58300), raddr=('127.0.0.1', 4254)> (0 sockets open)
Terminating took 0.897s
Launch: ./src/osmo-msc/osmo-msc -c /build/doc/examples/osmo-msc/osmo-msc.cfg from /build
Launching: PWD=/build './src/osmo-msc/osmo-msc' '-c' '/build/doc/examples/osmo-msc/osmo-msc.cfg'

> ls -l /proc/27731/fd
total 0
lr-x------ 1 build build 64 Aug 17 16:16 0 -> pipe:[459305918]
l-wx------ 1 build build 64 Aug 17 16:16 1 -> pipe:[459305919]
l-wx------ 1 build build 64 Aug 17 16:16 2 -> pipe:[459305920]
l-wx------ 1 build build 64 Aug 17 16:16 3 -> /dev/null


> ss -tn
State      Recv-Q Send-Q Local Address:Port               Peer Address:Port              


> ss -tln
State      Recv-Q Send-Q Local Address:Port               Peer Address:Port              


> ps xua | grep osmo
build    27731  5.0  0.0  53724 20772 ?        S    16:16   0:00 /usr/bin/python3 /usr/local/bin/osmotestvty.py -p /build -w /build -v
build    27754  0.0  0.0 21474989440 26244 ?   D    16:16   0:00 ./src/osmo-msc/osmo-msc -c /build/doc/examples/osmo-msc/osmo-msc.cfg
build    27761  0.0  0.0   4280   712 ?        S    16:16   0:00 /bin/sh -c ps xua | grep osmo
build    27763  0.0  0.0  12784   956 ?        S    16:16   0:00 grep osmo

ok

----------------------------------------------------------------------
Ran 3 tests in 4.819s

OK
Socket: in 1 tries, connected to 127.0.0.1:4254 <socket.socket fd=4, family=AddressFamily.AF_INET, type=SocketKind.SOCK_STREAM, proto=0, laddr=('127.0.0.1', 58302), raddr=('127.0.0.1', 4254)> (1 sockets open)
Socket: closing 127.0.0.1:4254 <socket.socket fd=4, family=AddressFamily.AF_INET, type=SocketKind.SOCK_STREAM, proto=0, laddr=('127.0.0.1', 58302), raddr=('127.0.0.1', 4254)> (0 sockets open)
Terminating took 0.897s
IU=0 osmotestconfig.py -p /build -w /build -v
Verifying src/osmo-msc/osmo-msc -c /build/doc/examples/osmo-msc/osmo-msc.cfg, test verify_doc
Opening /dev/null
Launching: PWD=/build 'src/osmo-msc/osmo-msc' '-c' '/build/doc/examples/osmo-msc/osmo-msc.cfg'

> ls -l /proc/27765/fd
total 0
lr-x------ 1 build build 64 Aug 17 16:17 0 -> pipe:[459305918]
l-wx------ 1 build build 64 Aug 17 16:17 1 -> pipe:[459305919]
l-wx------ 1 build build 64 Aug 17 16:17 2 -> pipe:[459305920]
l-wx------ 1 build build 64 Aug 17 16:17 3 -> /dev/null
Warning: doc/examples/osmo-msc/osmo-msc_custom-sccp.cfg is not being tested
Warning: doc/examples/osmo-msc/osmo-msc_multi-cs7.cfg is not being tested


> ss -tn
State      Recv-Q Send-Q Local Address:Port               Peer Address:Port              


> ss -tln
State      Recv-Q Send-Q Local Address:Port               Peer Address:Port              


> ps xua | grep osmo
build    27765  0.0  0.0  53788 21056 ?        S    16:16   0:00 /usr/bin/python3 /usr/local/bin/osmotestconfig.py -p /build -w /build -v
build    27766  0.0  0.0 21474989440 26288 ?   D    16:16   0:00 src/osmo-msc/osmo-msc -c /build/doc/examples/osmo-msc/osmo-msc.cfg
build    27773  0.0  0.0   4280   708 ?        S    16:16   0:00 /bin/sh -c ps xua | grep osmo
build    27775  0.0  0.0  12784  1024 ?        S    16:16   0:00 grep osmo

Socket: in 1 tries, connected to 127.0.0.1:4254 <socket.socket fd=4, family=AddressFamily.AF_INET, type=SocketKind.SOCK_STREAM, proto=0, laddr=('127.0.0.1', 58306), raddr=('127.0.0.1', 4254)> (1 sockets open)
Terminating took 0.897s
Socket: closing 127.0.0.1:4254 <socket.socket fd=4, family=AddressFamily.AF_INET, type=SocketKind.SOCK_STREAM, proto=0, laddr=('127.0.0.1', 58306), raddr=('127.0.0.1', 4254)> (0 sockets open)
Verifying src/osmo-msc/osmo-msc -c /build/writtenconfig/osmo-msc.cfgdcp2mbct, test write_config
Launching: PWD=/build 'src/osmo-msc/osmo-msc' '-c' '/build/writtenconfig/osmo-msc.cfgdcp2mbct'

> ls -l /proc/27765/fd
total 0
lr-x------ 1 build build 64 Aug 17 16:17 0 -> pipe:[459305918]
l-wx------ 1 build build 64 Aug 17 16:17 1 -> pipe:[459305919]
l-wx------ 1 build build 64 Aug 17 16:17 2 -> pipe:[459305920]
l-wx------ 1 build build 64 Aug 17 16:17 3 -> /dev/null
Documentation error (missing docs): 
<command id='no mgw reset-endpoint NAME'>
        <param name='NAME' doc='(null)' />



> ss -tn
State      Recv-Q Send-Q Local Address:Port               Peer Address:Port              


> ss -tln
State      Recv-Q Send-Q Local Address:Port               Peer Address:Port              


> ps xua | grep osmo
build    27765 14.0  0.0  54236 21580 ?        S    16:16   0:00 /usr/bin/python3 /usr/local/bin/osmotestconfig.py -p /build -w /build -v
build    27777  0.0  0.0 21474989440 26288 ?   D    16:17   0:00 src/osmo-msc/osmo-msc -c /build/writtenconfig/osmo-msc.cfgdcp2mbct
build    27784  0.0  0.0   4280   796 ?        S    16:17   0:00 /bin/sh -c ps xua | grep osmo
build    27786  0.0  0.0  12784   968 ?        R    16:17   0:00 grep osmo

Socket: in 1 tries, connected to 127.0.0.1:4254 <socket.socket fd=4, family=AddressFamily.AF_INET, type=SocketKind.SOCK_STREAM, proto=0, laddr=('127.0.0.1', 58308), raddr=('127.0.0.1', 4254)> (1 sockets open)
Terminating took 0.475s
Socket: closing 127.0.0.1:4254 <socket.socket fd=4, family=AddressFamily.AF_INET, type=SocketKind.SOCK_STREAM, proto=0, laddr=('127.0.0.1', 58308), raddr=('127.0.0.1', 4254)> (0 sockets open)
Verifying src/osmo-msc/osmo-msc -c /build/writtenconfig/osmo-msc.cfgdcp2mbct, test token_vty_command
Launching: PWD=/build 'src/osmo-msc/osmo-msc' '-c' '/build/writtenconfig/osmo-msc.cfgdcp2mbct'

> ls -l /proc/27765/fd
total 0
lr-x------ 1 build build 64 Aug 17 16:17 0 -> pipe:[459305918]
l-wx------ 1 build build 64 Aug 17 16:17 1 -> pipe:[459305919]
l-wx------ 1 build build 64 Aug 17 16:17 2 -> pipe:[459305920]
l-wx------ 1 build build 64 Aug 17 16:17 3 -> /dev/null


> ss -tn
State      Recv-Q Send-Q Local Address:Port               Peer Address:Port              


> ss -tln
State      Recv-Q Send-Q Local Address:Port               Peer Address:Port              


> ps xua | grep osmo
build    27765  5.0  0.0  54236 21580 ?        S    16:16   0:00 /usr/bin/python3 /usr/local/bin/osmotestconfig.py -p /build -w /build -v
build    27788  0.0  0.0 21474989440 26384 ?   D    16:17   0:00 src/osmo-msc/osmo-msc -c /build/writtenconfig/osmo-msc.cfgdcp2mbct
build    27795  0.0  0.0   4280   752 ?        S    16:17   0:00 /bin/sh -c ps xua | grep osmo
build    27797  0.0  0.0  12784   992 ?        S    16:17   0:00 grep osmo

ERRORS: 1
Socket: in 1 tries, connected to 127.0.0.1:4254 <socket.socket fd=4, family=AddressFamily.AF_INET, type=SocketKind.SOCK_STREAM, proto=0, laddr=('127.0.0.1', 58310), raddr=('127.0.0.1', 4254)> (1 sockets open)
Terminating took 0.897s
Socket: closing 127.0.0.1:4254 <socket.socket fd=4, family=AddressFamily.AF_INET, type=SocketKind.SOCK_STREAM, proto=0, laddr=('127.0.0.1', 58310), raddr=('127.0.0.1', 4254)> (0 sockets open)
make[7]: *** [vty-python-test] Error 1
Makefile:720: recipe for target 'vty-python-test' failed
make[7]: Leaving directory '/build/tests'
make[6]: *** [vty-test] Error 2
Makefile:740: recipe for target 'vty-test' failed
make[6]: Leaving directory '/build/tests'
make[5]: *** [python-tests] Error 2
Makefile:710: recipe for target 'python-tests' failed
make[5]: Leaving directory '/build/tests'
make[4]: *** [check-local] Error 2
Makefile:763: recipe for target 'check-local' failed
make[4]: Leaving directory '/build/tests'
make[3]: *** [check-am] Error 2
Makefile:569: recipe for target 'check-am' failed
make[3]: Leaving directory '/build/tests'
Makefile:421: recipe for target 'check-recursive' failed
make[2]: *** [check-recursive] Error 1
make[2]: Leaving directory '/build/tests'
Makefile:469: recipe for target 'check-recursive' failed
make[1]: Leaving directory '/build'
make[1]: *** [check-recursive] Error 1
Makefile:760: recipe for target 'check' failed
make: *** [check] Error 2
+ cat-testlogs.sh
Build step 'Execute shell' marked build as failure
[WARNINGS]Skipping publisher since build result is FAILURE


More information about the jenkins-notifications mailing list