Build failed in Jenkins: master-osmo-msc » --disable-iu,1,a3=default,a4=default,osmocom-master-debian9 #25982

jenkins at lists.osmocom.org jenkins at lists.osmocom.org
Tue Aug 17 16:11:41 UTC 2021


See <https://jenkins.osmocom.org/jenkins/job/master-osmo-msc/IU=--disable-iu,WITH_MANUALS=1,a3=default,a4=default,label=osmocom-master-debian9/25982/display/redirect>

Changes:


------------------------------------------
[...truncated 431.19 KB...]
## osmo-msc 1.7.0.20-945b0 test suite. ##
## ----------------------------------- ##

Regression tests.

  1: smpp                                            ok
  2: sms_queue_test                                  ok
  3: db_sms_test                                     ok
  4: msc_vlr_test_no_authen                          ok
  5: msc_vlr_test_gsm_authen                         ok
  6: msc_vlr_test_gsm_ciph                           ok
  7: msc_vlr_test_umts_authen                        ok
  8: msc_vlr_test_authen_reuse                       ok
  9: msc_vlr_test_hlr_reject                         ok
 10: msc_vlr_test_hlr_timeout                        ok
 11: msc_vlr_test_ms_timeout                         ok
 12: msc_vlr_test_reject_concurrency                 ok
 13: msc_vlr_test_call                               ok
 14: msc_vlr_test_rest                               ok
 15: msc_vlr_test_ss                                 ok
 16: sdp_msg_test                                    ok
 17: mncc_test                                       ok

## ------------- ##
## Test results. ##
## ------------- ##

All 17 tests were successful.
make  python-tests
make[5]: Entering directory '/build/tests'
make vty-test
make[6]: Entering directory '/build/tests'
make vty-python-test
make[7]: Entering directory '/build/tests'
IU=0 osmotestvty.py -p /build -w /build -v
test_history (__main__.TestVTY) ... confpath /build, workdir /build
Running tests for specific VTY commands
Launch: ./src/osmo-msc/osmo-msc -c /build/doc/examples/osmo-msc/osmo-msc.cfg from /build
Opening /dev/null
Launching: PWD=/build './src/osmo-msc/osmo-msc' '-c' '/build/doc/examples/osmo-msc/osmo-msc.cfg'

> ls -l /proc/27717/fd
total 0
lr-x------ 1 build build 64 Aug 17 16:11 0 -> pipe:[458116310]
l-wx------ 1 build build 64 Aug 17 16:11 1 -> pipe:[458116311]
l-wx------ 1 build build 64 Aug 17 16:11 2 -> pipe:[458116312]
l-wx------ 1 build build 64 Aug 17 16:11 3 -> /dev/null


> ss -tn
State      Recv-Q Send-Q Local Address:Port               Peer Address:Port              


> ss -tln
State      Recv-Q Send-Q Local Address:Port               Peer Address:Port              


> ps xua | grep osmo
build    27717  0.0  0.0  53724 20728 ?        S    16:11   0:00 /usr/bin/python3 /usr/local/bin/osmotestvty.py -p /build -w /build -v
build    27718  0.0  0.0 21474989440 26392 ?   D    16:11   0:00 ./src/osmo-msc/osmo-msc -c /build/doc/examples/osmo-msc/osmo-msc.cfg
build    27725  0.0  0.0   4280   704 ?        S    16:11   0:00 /bin/sh -c ps xua | grep osmo
build    27727  0.0  0.0  12784   940 ?        S    16:11   0:00 grep osmo

ok
test_terminal_length (__main__.TestVTY) ... Socket: in 1 tries, connected to 127.0.0.1:4254 <socket.socket fd=4, family=AddressFamily.AF_INET, type=SocketKind.SOCK_STREAM, proto=0, laddr=('127.0.0.1', 57650), raddr=('127.0.0.1', 4254)> (1 sockets open)
Socket: closing 127.0.0.1:4254 <socket.socket fd=4, family=AddressFamily.AF_INET, type=SocketKind.SOCK_STREAM, proto=0, laddr=('127.0.0.1', 57650), raddr=('127.0.0.1', 4254)> (0 sockets open)
Terminating took 0.897s
Launch: ./src/osmo-msc/osmo-msc -c /build/doc/examples/osmo-msc/osmo-msc.cfg from /build
Launching: PWD=/build './src/osmo-msc/osmo-msc' '-c' '/build/doc/examples/osmo-msc/osmo-msc.cfg'

> ls -l /proc/27717/fd
total 0
lr-x------ 1 build build 64 Aug 17 16:11 0 -> pipe:[458116310]
l-wx------ 1 build build 64 Aug 17 16:11 1 -> pipe:[458116311]
l-wx------ 1 build build 64 Aug 17 16:11 2 -> pipe:[458116312]
l-wx------ 1 build build 64 Aug 17 16:11 3 -> /dev/null


> ss -tn
State      Recv-Q Send-Q Local Address:Port               Peer Address:Port              


> ss -tln
State      Recv-Q Send-Q Local Address:Port               Peer Address:Port              


> ps xua | grep osmo
build    27717  8.0  0.0  53724 20816 ?        S    16:11   0:00 /usr/bin/python3 /usr/local/bin/osmotestvty.py -p /build -w /build -v
build    27729  0.0  0.0 21474983812 23632 ?   R    16:11   0:00 ./src/osmo-msc/osmo-msc -c /build/doc/examples/osmo-msc/osmo-msc.cfg
build    27736  0.0  0.0   4280   748 ?        S    16:11   0:00 /bin/sh -c ps xua | grep osmo
build    27738  0.0  0.0  12784   984 ?        S    16:11   0:00 grep osmo

ok
test_unknown_command (__main__.TestVTY) ... Connecting socket failed, retrying...
Socket: in 2 tries, connected to 127.0.0.1:4254 <socket.socket fd=5, family=AddressFamily.AF_INET, type=SocketKind.SOCK_STREAM, proto=0, laddr=('127.0.0.1', 57658), raddr=('127.0.0.1', 4254)> (1 sockets open)
Socket: closing 127.0.0.1:4254 <socket.socket fd=5, family=AddressFamily.AF_INET, type=SocketKind.SOCK_STREAM, proto=0, laddr=('127.0.0.1', 57658), raddr=('127.0.0.1', 4254)> (0 sockets open)
Terminating took 0.897s
Launch: ./src/osmo-msc/osmo-msc -c /build/doc/examples/osmo-msc/osmo-msc.cfg from /build
Launching: PWD=/build './src/osmo-msc/osmo-msc' '-c' '/build/doc/examples/osmo-msc/osmo-msc.cfg'

> ls -l /proc/27717/fd
total 0
lr-x------ 1 build build 64 Aug 17 16:11 0 -> pipe:[458116310]
l-wx------ 1 build build 64 Aug 17 16:11 1 -> pipe:[458116311]
l-wx------ 1 build build 64 Aug 17 16:11 2 -> pipe:[458116312]
l-wx------ 1 build build 64 Aug 17 16:11 3 -> /dev/null


> ss -tn
State      Recv-Q Send-Q Local Address:Port               Peer Address:Port              


> ss -tln
State      Recv-Q Send-Q Local Address:Port               Peer Address:Port              


> ps xua | grep osmo
build    27717  5.3  0.0  53724 20816 ?        S    16:11   0:00 /usr/bin/python3 /usr/local/bin/osmotestvty.py -p /build -w /build -v
build    27740  0.0  0.0 21474989440 26340 ?   D    16:11   0:00 ./src/osmo-msc/osmo-msc -c /build/doc/examples/osmo-msc/osmo-msc.cfg
build    27747  0.0  0.0   4280   696 ?        S    16:11   0:00 /bin/sh -c ps xua | grep osmo
build    27749  0.0  0.0  12784   952 ?        S    16:11   0:00 grep osmo

ok

----------------------------------------------------------------------
Ran 3 tests in 3.541s

OK
Socket: in 1 tries, connected to 127.0.0.1:4254 <socket.socket fd=4, family=AddressFamily.AF_INET, type=SocketKind.SOCK_STREAM, proto=0, laddr=('127.0.0.1', 57660), raddr=('127.0.0.1', 4254)> (1 sockets open)
Socket: closing 127.0.0.1:4254 <socket.socket fd=4, family=AddressFamily.AF_INET, type=SocketKind.SOCK_STREAM, proto=0, laddr=('127.0.0.1', 57660), raddr=('127.0.0.1', 4254)> (0 sockets open)
IU=0 osmotestconfig.py -p /build -w /build -v
Verifying src/osmo-msc/osmo-msc -c /build/doc/examples/osmo-msc/osmo-msc.cfg, test verify_doc
Opening /dev/null
Launching: PWD=/build 'src/osmo-msc/osmo-msc' '-c' '/build/doc/examples/osmo-msc/osmo-msc.cfg'

> ls -l /proc/27751/fd
total 0
lr-x------ 1 build build 64 Aug 17 16:11 0 -> pipe:[458116310]
l-wx------ 1 build build 64 Aug 17 16:11 1 -> pipe:[458116311]
l-wx------ 1 build build 64 Aug 17 16:11 2 -> pipe:[458116312]
l-wx------ 1 build build 64 Aug 17 16:11 3 -> /dev/null


> ss -tn
Warning: doc/examples/osmo-msc/osmo-msc_custom-sccp.cfg is not being tested
Warning: doc/examples/osmo-msc/osmo-msc_multi-cs7.cfg is not being tested
State      Recv-Q Send-Q Local Address:Port               Peer Address:Port              


> ss -tln
State      Recv-Q Send-Q Local Address:Port               Peer Address:Port              


> ps xua | grep osmo
build    27751 15.0  0.0  53712 20784 ?        S    16:11   0:00 /usr/bin/python3 /usr/local/bin/osmotestconfig.py -p /build -w /build -v
build    27752  0.0  0.0 21474989440 26392 ?   D    16:11   0:00 src/osmo-msc/osmo-msc -c /build/doc/examples/osmo-msc/osmo-msc.cfg
build    27759  0.0  0.0   4280   744 ?        S    16:11   0:00 /bin/sh -c ps xua | grep osmo
build    27761  0.0  0.0  12784  1024 ?        S    16:11   0:00 grep osmo

Socket: in 1 tries, connected to 127.0.0.1:4254 <socket.socket fd=4, family=AddressFamily.AF_INET, type=SocketKind.SOCK_STREAM, proto=0, laddr=('127.0.0.1', 57666), raddr=('127.0.0.1', 4254)> (1 sockets open)
Terminating took 0.897s
Socket: closing 127.0.0.1:4254 <socket.socket fd=4, family=AddressFamily.AF_INET, type=SocketKind.SOCK_STREAM, proto=0, laddr=('127.0.0.1', 57666), raddr=('127.0.0.1', 4254)> (0 sockets open)
Verifying src/osmo-msc/osmo-msc -c /build/writtenconfig/osmo-msc.cfgw7slw2_a, test write_config
Launching: PWD=/build 'src/osmo-msc/osmo-msc' '-c' '/build/writtenconfig/osmo-msc.cfgw7slw2_a'

> ls -l /proc/27751/fd
total 0
lr-x------ 1 build build 64 Aug 17 16:11 0 -> pipe:[458116310]
l-wx------ 1 build build 64 Aug 17 16:11 1 -> pipe:[458116311]
l-wx------ 1 build build 64 Aug 17 16:11 2 -> pipe:[458116312]
l-wx------ 1 build build 64 Aug 17 16:11 3 -> /dev/null

Documentation error (missing docs): 
<command id='no mgw reset-endpoint NAME'>
        <param name='NAME' doc='(null)' />


> ss -tn
State      Recv-Q Send-Q Local Address:Port               Peer Address:Port              


> ss -tln
State      Recv-Q Send-Q Local Address:Port               Peer Address:Port              


> ps xua | grep osmo
build    27751  8.0  0.0  54336 21344 ?        S    16:11   0:00 /usr/bin/python3 /usr/local/bin/osmotestconfig.py -p /build -w /build -v
build    27763  0.0  0.0 21474989440 26388 ?   R    16:11   0:00 src/osmo-msc/osmo-msc -c /build/writtenconfig/osmo-msc.cfgw7slw2_a
build    27770  0.0  0.0   4280   716 ?        S    16:11   0:00 /bin/sh -c ps xua | grep osmo
build    27772  0.0  0.0  12784   900 ?        S    16:11   0:00 grep osmo

Socket: in 1 tries, connected to 127.0.0.1:4254 <socket.socket fd=4, family=AddressFamily.AF_INET, type=SocketKind.SOCK_STREAM, proto=0, laddr=('127.0.0.1', 57672), raddr=('127.0.0.1', 4254)> (1 sockets open)
Terminating took 0.897s
Socket: closing 127.0.0.1:4254 <socket.socket fd=4, family=AddressFamily.AF_INET, type=SocketKind.SOCK_STREAM, proto=0, laddr=('127.0.0.1', 57672), raddr=('127.0.0.1', 4254)> (0 sockets open)
Verifying src/osmo-msc/osmo-msc -c /build/writtenconfig/osmo-msc.cfgw7slw2_a, test token_vty_command
Launching: PWD=/build 'src/osmo-msc/osmo-msc' '-c' '/build/writtenconfig/osmo-msc.cfgw7slw2_a'

> ls -l /proc/27751/fd
total 0
lr-x------ 1 build build 64 Aug 17 16:11 0 -> pipe:[458116310]
l-wx------ 1 build build 64 Aug 17 16:11 1 -> pipe:[458116311]
l-wx------ 1 build build 64 Aug 17 16:11 2 -> pipe:[458116312]
l-wx------ 1 build build 64 Aug 17 16:11 3 -> /dev/null


> ss -tn
State      Recv-Q Send-Q Local Address:Port               Peer Address:Port              


> ss -tln
State      Recv-Q Send-Q Local Address:Port               Peer Address:Port              


> ps xua | grep osmo
build    27751  4.2  0.0  54336 21344 ?        S    16:11   0:00 /usr/bin/python3 /usr/local/bin/osmotestconfig.py -p /build -w /build -v
build    27774  0.0  0.0 21474989440 26756 ?   D    16:11   0:00 src/osmo-msc/osmo-msc -c /build/writtenconfig/osmo-msc.cfgw7slw2_a
build    27781  0.0  0.0   4280   744 ?        S    16:11   0:00 /bin/sh -c ps xua | grep osmo
build    27783  0.0  0.0  12784   932 ?        S    16:11   0:00 grep osmo

ERRORS: 1
Socket: in 1 tries, connected to 127.0.0.1:4254 <socket.socket fd=4, family=AddressFamily.AF_INET, type=SocketKind.SOCK_STREAM, proto=0, laddr=('127.0.0.1', 57678), raddr=('127.0.0.1', 4254)> (1 sockets open)
Terminating took 0.897s
Socket: closing 127.0.0.1:4254 <socket.socket fd=4, family=AddressFamily.AF_INET, type=SocketKind.SOCK_STREAM, proto=0, laddr=('127.0.0.1', 57678), raddr=('127.0.0.1', 4254)> (0 sockets open)
make[7]: *** [vty-python-test] Error 1
Makefile:720: recipe for target 'vty-python-test' failed
make[7]: Leaving directory '/build/tests'
Makefile:740: recipe for target 'vty-test' failed
make[6]: Leaving directory '/build/tests'
make[6]: *** [vty-test] Error 2
make[5]: *** [python-tests] Error 2
Makefile:710: recipe for target 'python-tests' failed
make[5]: Leaving directory '/build/tests'
Makefile:763: recipe for target 'check-local' failed
make[4]: Leaving directory '/build/tests'
make[4]: *** [check-local] Error 2
make[3]: *** [check-am] Error 2
Makefile:569: recipe for target 'check-am' failed
make[3]: Leaving directory '/build/tests'
make[2]: *** [check-recursive] Error 1
Makefile:421: recipe for target 'check-recursive' failed
make[2]: Leaving directory '/build/tests'
Makefile:469: recipe for target 'check-recursive' failed
make[1]: *** [check-recursive] Error 1
make[1]: Leaving directory '/build'
Makefile:760: recipe for target 'check' failed
make: *** [check] Error 2
+ cat-testlogs.sh
Build step 'Execute shell' marked build as failure
[WARNINGS]Skipping publisher since build result is FAILURE


More information about the jenkins-notifications mailing list