Build failure of network:osmocom:latest/osmo-sgsn in xUbuntu_17.04/x86_64

OBS Notification admin at opensuse.org
Wed May 8 03:09:21 UTC 2019


Visit https://build.opensuse.org/package/live_build_log/network:osmocom:latest/osmo-sgsn/xUbuntu_17.04/x86_64

Package network:osmocom:latest/osmo-sgsn failed to build in xUbuntu_17.04/x86_64

Check out the package for editing:
  osc checkout network:osmocom:latest osmo-sgsn

Last lines of build log:
[  153s] | #define HAVE_MEMORY_H 1
[  153s] | #define HAVE_STRINGS_H 1
[  153s] | #define HAVE_INTTYPES_H 1
[  153s] | #define HAVE_STDINT_H 1
[  153s] | #define HAVE_UNISTD_H 1
[  153s] | #define HAVE_DLFCN_H 1
[  153s] | #define LT_OBJDIR ".libs/"
[  153s] | #define BUILD_IU 1
[  153s] | #define STDC_HEADERS 1
[  153s] | #define HAVE_TM_GMTOFF_IN_TM 1
[  153s] | 
[  153s] | configure: exit 0
[  153s] 
[  153s] debian/rules:65: recipe for target 'override_dh_auto_test' failed
[  153s] make[1]: *** [override_dh_auto_test] Error 1
[  153s] make[1]: Leaving directory '/usr/src/packages/BUILD'
[  153s] debian/rules:45: recipe for target 'build' failed
[  153s] make: *** [build] Error 2
[  153s] dpkg-buildpackage: error: debian/rules build gave error exit status 2
[  153s] 
[  153s] lamb01 failed "build osmo-sgsn_1.4.0.dsc" at Wed May  8 03:09:12 UTC 2019.
[  153s] 
[  153s] ### VM INTERACTION START ###
[  156s] [  142.324429] sysrq: SysRq : Power Off
[  156s] [  142.337509] reboot: Power down
[  156s] ### VM INTERACTION END ###
[  156s] 
[  156s] lamb01 failed "build osmo-sgsn_1.4.0.dsc" at Wed May  8 03:09:16 UTC 2019.
[  156s] 

-- 
Configure notifications at https://build.opensuse.org/user/notifications
openSUSE Build Service (https://build.opensuse.org/)


More information about the gerrit-log mailing list