Build failure of network:osmocom:latest/osmo-sgsn in xUbuntu_16.10/x86_64

OBS Notification admin at opensuse.org
Wed May 8 03:08:46 UTC 2019


Visit https://build.opensuse.org/package/live_build_log/network:osmocom:latest/osmo-sgsn/xUbuntu_16.10/x86_64

Package network:osmocom:latest/osmo-sgsn failed to build in xUbuntu_16.10/x86_64

Check out the package for editing:
  osc checkout network:osmocom:latest osmo-sgsn

Last lines of build log:
[  108s] | #define HAVE_MEMORY_H 1
[  108s] | #define HAVE_STRINGS_H 1
[  108s] | #define HAVE_INTTYPES_H 1
[  108s] | #define HAVE_STDINT_H 1
[  108s] | #define HAVE_UNISTD_H 1
[  108s] | #define HAVE_DLFCN_H 1
[  108s] | #define LT_OBJDIR ".libs/"
[  108s] | #define BUILD_IU 1
[  108s] | #define STDC_HEADERS 1
[  108s] | #define HAVE_TM_GMTOFF_IN_TM 1
[  108s] | 
[  108s] | configure: exit 0
[  108s] 
[  108s] debian/rules:65: recipe for target 'override_dh_auto_test' failed
[  108s] make[1]: *** [override_dh_auto_test] Error 1
[  108s] make[1]: Leaving directory '/usr/src/packages/BUILD'
[  108s] debian/rules:45: recipe for target 'build' failed
[  108s] make: *** [build] Error 2
[  108s] dpkg-buildpackage: error: debian/rules build gave error exit status 2
[  108s] 
[  108s] lamb19 failed "build osmo-sgsn_1.4.0.dsc" at Wed May  8 03:08:25 UTC 2019.
[  108s] 
[  108s] ### VM INTERACTION START ###
[  111s] [   99.783721] sysrq: SysRq : Power Off
[  111s] [   99.790673] reboot: Power down
[  111s] ### VM INTERACTION END ###
[  111s] 
[  111s] lamb19 failed "build osmo-sgsn_1.4.0.dsc" at Wed May  8 03:08:29 UTC 2019.
[  111s] 

-- 
Configure notifications at https://build.opensuse.org/user/notifications
openSUSE Build Service (https://build.opensuse.org/)


More information about the gerrit-log mailing list