Build failure of network:osmocom:latest/osmo-sgsn in Debian_9.0/x86_64

OBS Notification admin at opensuse.org
Wed May 8 03:08:29 UTC 2019


Visit https://build.opensuse.org/package/live_build_log/network:osmocom:latest/osmo-sgsn/Debian_9.0/x86_64

Package network:osmocom:latest/osmo-sgsn failed to build in Debian_9.0/x86_64

Check out the package for editing:
  osc checkout network:osmocom:latest osmo-sgsn

Last lines of build log:
[  104s] | #define HAVE_MEMORY_H 1
[  104s] | #define HAVE_STRINGS_H 1
[  104s] | #define HAVE_INTTYPES_H 1
[  104s] | #define HAVE_STDINT_H 1
[  104s] | #define HAVE_UNISTD_H 1
[  104s] | #define HAVE_DLFCN_H 1
[  104s] | #define LT_OBJDIR ".libs/"
[  104s] | #define BUILD_IU 1
[  104s] | #define STDC_HEADERS 1
[  104s] | #define HAVE_TM_GMTOFF_IN_TM 1
[  104s] | 
[  104s] | configure: exit 0
[  104s] 
[  104s] debian/rules:65: recipe for target 'override_dh_auto_test' failed
[  104s] make[1]: *** [override_dh_auto_test] Error 1
[  104s] make[1]: Leaving directory '/usr/src/packages/BUILD'
[  104s] debian/rules:45: recipe for target 'build' failed
[  104s] make: *** [build] Error 2
[  104s] dpkg-buildpackage: error: debian/rules build gave error exit status 2
[  104s] 
[  104s] lamb12 failed "build osmo-sgsn_1.4.0.dsc" at Wed May  8 03:08:23 UTC 2019.
[  104s] 
[  104s] ### VM INTERACTION START ###
[  107s] [   94.505476] sysrq: SysRq : Power Off
[  107s] [   94.510614] reboot: Power down
[  107s] ### VM INTERACTION END ###
[  107s] 
[  107s] lamb12 failed "build osmo-sgsn_1.4.0.dsc" at Wed May  8 03:08:27 UTC 2019.
[  107s] 

-- 
Configure notifications at https://build.opensuse.org/user/notifications
openSUSE Build Service (https://build.opensuse.org/)


More information about the gerrit-log mailing list