Build failure of network:osmocom:latest/osmo-bsc in Debian_9.0/i586

OBS Notification admin at opensuse.org
Wed May 8 03:06:12 UTC 2019


Visit https://build.opensuse.org/package/live_build_log/network:osmocom:latest/osmo-bsc/Debian_9.0/i586

Package network:osmocom:latest/osmo-bsc failed to build in Debian_9.0/i586

Check out the package for editing:
  osc checkout network:osmocom:latest osmo-bsc

Last lines of build log:
[  150s] DRSL handover_fsm.c:844 handover(intraBSC_conn4294967295_IMSI000001){WAIT_LCHAN_ACTIVE}: Freeing instance
[  150s] DRSL fsm.c:535 handover(intraBSC_conn4294967295_IMSI000001){WAIT_LCHAN_ACTIVE}: Deallocated
[  150s] DCHAN lchan_fsm.c:544 lchan(1-0-1-TCH_F-0){WAIT_BEFORE_RF_RELEASE}: state_chg to UNUSED
[  150s] DCHAN lchan_fsm.c:377 lchan(1-0-1-TCH_F-0){UNUSED}: (type=TCH_F) Clearing lchan state
[  150s] DTS lchan_fsm.c:410 timeslot(1-0-1-TCH_F){UNUSED}: Received Event TS_EV_LCHAN_UNUSED
[  150s] - Expecting channel request at BTS 1 TS 1
[  150s] --- expout	2019-05-08 03:05:46.124000000 +0000
[  150s] +++ /usr/src/packages/BUILD/tests/testsuite.dir/at-groups/24/stdout	2019-05-08 03:05:46.128000000 +0000
[  150s] @@ -1 +1 @@
[  150s] -Test OK
[  150s] +Test failed, because no channel was requested
[  150s] ./testsuite.at:147: exit code was 1, expected 0
[  150s] 24. testsuite.at:144: 24. handover test 16 (testsuite.at:144): FAILED (testsuite.at:147)
[  150s] debian/rules:62: recipe for target 'override_dh_auto_test' failed
[  150s] make[1]: *** [override_dh_auto_test] Error 1
[  150s] make[1]: Leaving directory '/usr/src/packages/BUILD'
[  150s] debian/rules:45: recipe for target 'build' failed
[  150s] make: *** [build] Error 2
[  150s] dpkg-buildpackage: error: debian/rules build gave error exit status 2
[  150s] 
[  150s] lamb07 failed "build osmo-bsc_1.4.0.dsc" at Wed May  8 03:06:06 UTC 2019.
[  150s] 
[  150s] ### VM INTERACTION START ###
[  153s] [  139.977822] sysrq: SysRq : Power Off
[  153s] [  139.982678] reboot: Power down
[  153s] ### VM INTERACTION END ###
[  153s] 
[  153s] lamb07 failed "build osmo-bsc_1.4.0.dsc" at Wed May  8 03:06:10 UTC 2019.
[  153s] 

-- 
Configure notifications at https://build.opensuse.org/user/notifications
openSUSE Build Service (https://build.opensuse.org/)


More information about the gerrit-log mailing list