Build failure of network:osmocom:latest/osmo-sgsn in xUbuntu_16.04/x86_64

OBS Notification admin at opensuse.org
Wed May 8 03:12:29 UTC 2019


Visit https://build.opensuse.org/package/live_build_log/network:osmocom:latest/osmo-sgsn/xUbuntu_16.04/x86_64

Package network:osmocom:latest/osmo-sgsn failed to build in xUbuntu_16.04/x86_64

Check out the package for editing:
  osc checkout network:osmocom:latest osmo-sgsn

Last lines of build log:
[   83s] | #define HAVE_MEMORY_H 1
[   83s] | #define HAVE_STRINGS_H 1
[   83s] | #define HAVE_INTTYPES_H 1
[   83s] | #define HAVE_STDINT_H 1
[   83s] | #define HAVE_UNISTD_H 1
[   83s] | #define HAVE_DLFCN_H 1
[   83s] | #define LT_OBJDIR ".libs/"
[   83s] | #define BUILD_IU 1
[   83s] | #define STDC_HEADERS 1
[   83s] | #define HAVE_TM_GMTOFF_IN_TM 1
[   83s] | 
[   83s] | configure: exit 0
[   83s] 
[   83s] debian/rules:65: recipe for target 'override_dh_auto_test' failed
[   83s] make[1]: *** [override_dh_auto_test] Error 1
[   83s] make[1]: Leaving directory '/usr/src/packages/BUILD'
[   83s] debian/rules:45: recipe for target 'build' failed
[   83s] make: *** [build] Error 2
[   83s] dpkg-buildpackage: error: debian/rules build gave error exit status 2
[   83s] 
[   83s] sheep84 failed "build osmo-sgsn_1.4.0.dsc" at Wed May  8 03:12:14 UTC 2019.
[   83s] 
[   83s] ### VM INTERACTION START ###
[   86s] [   78.046868] sysrq: SysRq : Power Off
[   86s] [   78.051714] reboot: Power down
[   86s] ### VM INTERACTION END ###
[   86s] 
[   86s] sheep84 failed "build osmo-sgsn_1.4.0.dsc" at Wed May  8 03:12:18 UTC 2019.
[   86s] 

-- 
Configure notifications at https://build.opensuse.org/user/notifications
openSUSE Build Service (https://build.opensuse.org/)


More information about the gerrit-log mailing list