Build failure of network:osmocom:latest/osmo-sgsn in xUbuntu_17.10/x86_64

OBS Notification admin at opensuse.org
Wed May 8 02:48:46 UTC 2019


Visit https://build.opensuse.org/package/live_build_log/network:osmocom:latest/osmo-sgsn/xUbuntu_17.10/x86_64

Package network:osmocom:latest/osmo-sgsn failed to build in xUbuntu_17.10/x86_64

Check out the package for editing:
  osc checkout network:osmocom:latest osmo-sgsn

Last lines of build log:
[  250s] | #define HAVE_MEMORY_H 1
[  250s] | #define HAVE_STRINGS_H 1
[  250s] | #define HAVE_INTTYPES_H 1
[  250s] | #define HAVE_STDINT_H 1
[  250s] | #define HAVE_UNISTD_H 1
[  250s] | #define HAVE_DLFCN_H 1
[  250s] | #define LT_OBJDIR ".libs/"
[  250s] | #define BUILD_IU 1
[  250s] | #define STDC_HEADERS 1
[  250s] | #define HAVE_TM_GMTOFF_IN_TM 1
[  250s] | 
[  250s] | configure: exit 0
[  250s] 
[  250s] debian/rules:65: recipe for target 'override_dh_auto_test' failed
[  250s] make[1]: *** [override_dh_auto_test] Error 1
[  250s] make[1]: Leaving directory '/usr/src/packages/BUILD'
[  250s] debian/rules:45: recipe for target 'build' failed
[  250s] make: *** [build] Error 2
[  250s] dpkg-buildpackage: error: debian/rules build gave error exit status 2
[  250s] 
[  250s] lamb57 failed "build osmo-sgsn_1.4.0.dsc" at Wed May  8 02:48:34 UTC 2019.
[  250s] 
[  250s] ### VM INTERACTION START ###
[  253s] [  219.165589] sysrq: SysRq : Power Off
[  253s] [  219.190938] reboot: Power down
[  253s] ### VM INTERACTION END ###
[  253s] 
[  253s] lamb57 failed "build osmo-sgsn_1.4.0.dsc" at Wed May  8 02:48:39 UTC 2019.
[  253s] 

-- 
Configure notifications at https://build.opensuse.org/user/notifications
openSUSE Build Service (https://build.opensuse.org/)


More information about the gerrit-log mailing list