Build failure of network:osmocom:latest/osmo-bsc in xUbuntu_16.04/i586

OBS Notification admin at opensuse.org
Wed May 8 02:44:12 UTC 2019


Visit https://build.opensuse.org/package/live_build_log/network:osmocom:latest/osmo-bsc/xUbuntu_16.04/i586

Package network:osmocom:latest/osmo-bsc failed to build in xUbuntu_16.04/i586

Check out the package for editing:
  osc checkout network:osmocom:latest osmo-bsc

Last lines of build log:
[  168s] DRSL handover_fsm.c:844 handover(intraBSC_conn4294967295_IMSI000001){WAIT_LCHAN_ACTIVE}: Freeing instance
[  168s] DRSL fsm.c:535 handover(intraBSC_conn4294967295_IMSI000001){WAIT_LCHAN_ACTIVE}: Deallocated
[  168s] DCHAN lchan_fsm.c:544 lchan(1-0-1-TCH_F-0){WAIT_BEFORE_RF_RELEASE}: state_chg to UNUSED
[  168s] DCHAN lchan_fsm.c:377 lchan(1-0-1-TCH_F-0){UNUSED}: (type=TCH_F) Clearing lchan state
[  168s] DTS lchan_fsm.c:410 timeslot(1-0-1-TCH_F){UNUSED}: Received Event TS_EV_LCHAN_UNUSED
[  168s] - Expecting channel request at BTS 1 TS 1
[  168s] --- expout	2019-05-08 02:43:44.384000000 +0000
[  168s] +++ /usr/src/packages/BUILD/tests/testsuite.dir/at-groups/23/stdout	2019-05-08 02:43:44.388000000 +0000
[  168s] @@ -1 +1 @@
[  168s] -Test OK
[  168s] +Test failed, because no channel was requested
[  168s] ./testsuite.at:141: exit code was 1, expected 0
[  168s] 23. testsuite.at:138: 23. handover test 15 (testsuite.at:138): FAILED (testsuite.at:141)
[  168s] debian/rules:62: recipe for target 'override_dh_auto_test' failed
[  168s] make[1]: *** [override_dh_auto_test] Error 1
[  168s] make[1]: Leaving directory '/usr/src/packages/BUILD'
[  168s] debian/rules:45: recipe for target 'build' failed
[  168s] make: *** [build] Error 2
[  168s] dpkg-buildpackage: error: debian/rules build gave error exit status 2
[  168s] 
[  168s] lamb27 failed "build osmo-bsc_1.4.0.dsc" at Wed May  8 02:44:05 UTC 2019.
[  168s] 
[  168s] ### VM INTERACTION START ###
[  171s] [  160.237932] sysrq: SysRq : Power Off
[  171s] [  160.243570] reboot: Power down
[  171s] ### VM INTERACTION END ###
[  171s] 
[  171s] lamb27 failed "build osmo-bsc_1.4.0.dsc" at Wed May  8 02:44:09 UTC 2019.
[  171s] 

-- 
Configure notifications at https://build.opensuse.org/user/notifications
openSUSE Build Service (https://build.opensuse.org/)


More information about the gerrit-log mailing list