Build failure of network:osmocom:latest/osmo-sgsn in xUbuntu_16.10/i586

OBS Notification admin at opensuse.org
Wed May 8 02:57:04 UTC 2019


Visit https://build.opensuse.org/package/live_build_log/network:osmocom:latest/osmo-sgsn/xUbuntu_16.10/i586

Package network:osmocom:latest/osmo-sgsn failed to build in xUbuntu_16.10/i586

Check out the package for editing:
  osc checkout network:osmocom:latest osmo-sgsn

Last lines of build log:
[  148s] | #define HAVE_MEMORY_H 1
[  148s] | #define HAVE_STRINGS_H 1
[  148s] | #define HAVE_INTTYPES_H 1
[  148s] | #define HAVE_STDINT_H 1
[  148s] | #define HAVE_UNISTD_H 1
[  148s] | #define HAVE_DLFCN_H 1
[  148s] | #define LT_OBJDIR ".libs/"
[  148s] | #define BUILD_IU 1
[  148s] | #define STDC_HEADERS 1
[  148s] | #define HAVE_TM_GMTOFF_IN_TM 1
[  148s] | 
[  148s] | configure: exit 0
[  148s] 
[  148s] debian/rules:65: recipe for target 'override_dh_auto_test' failed
[  148s] make[1]: *** [override_dh_auto_test] Error 1
[  148s] make[1]: Leaving directory '/usr/src/packages/BUILD'
[  148s] debian/rules:45: recipe for target 'build' failed
[  148s] make: *** [build] Error 2
[  148s] dpkg-buildpackage: error: debian/rules build gave error exit status 2
[  148s] 
[  148s] lamb58 failed "build osmo-sgsn_1.4.0.dsc" at Wed May  8 02:56:50 UTC 2019.
[  148s] 
[  148s] ### VM INTERACTION START ###
[  151s] [  139.298240] sysrq: SysRq : Power Off
[  151s] [  139.306137] reboot: Power down
[  151s] ### VM INTERACTION END ###
[  152s] 
[  152s] lamb58 failed "build osmo-sgsn_1.4.0.dsc" at Wed May  8 02:56:56 UTC 2019.
[  152s] 

-- 
Configure notifications at https://build.opensuse.org/user/notifications
openSUSE Build Service (https://build.opensuse.org/)


More information about the gerrit-log mailing list