Build failure of network:osmocom:nightly/osmo-msc in Debian_Testing/x86_64

OBS Notification admin at opensuse.org
Wed Jun 5 03:15:24 UTC 2019


Visit https://build.opensuse.org/package/live_build_log/network:osmocom:nightly/osmo-msc/Debian_Testing/x86_64

Package network:osmocom:nightly/osmo-msc failed to build in Debian_Testing/x86_64

Check out the package for editing:
  osc checkout network:osmocom:nightly osmo-msc

Last lines of build log:
[  572s] | #define HAVE_STRINGS_H 1
[  572s] | #define HAVE_INTTYPES_H 1
[  572s] | #define HAVE_STDINT_H 1
[  572s] | #define HAVE_UNISTD_H 1
[  572s] | #define HAVE_DLFCN_H 1
[  572s] | #define LT_OBJDIR ".libs/"
[  572s] | #define HAVE_LIBSCTP 1
[  572s] | #define BUILD_SMPP 1
[  572s] | #define BUILD_IU 1
[  572s] | #define STDC_HEADERS 1
[  572s] | #define HAVE_DBI_DBD_H 1
[  572s] | #define HAVE_TM_GMTOFF_IN_TM 1
[  572s] | 
[  572s] | configure: exit 0
[  572s] 
[  572s] make[1]: *** [debian/rules:63: override_dh_auto_test] Error 1
[  572s] make[1]: Leaving directory '/usr/src/packages/BUILD'
[  572s] make: *** [debian/rules:45: build] Error 2
[  572s] dpkg-buildpackage: error: debian/rules build subprocess returned exit status 2
[  572s] 
[  572s] lamb16 failed "build osmo-msc_1.3.1.135.17aa.dsc" at Wed Jun  5 03:15:16 UTC 2019.
[  572s] 
[  572s] ### VM INTERACTION START ###
[  575s] [  557.870646] sysrq: SysRq : Power Off
[  575s] [  557.910474] reboot: Power down
[  575s] ### VM INTERACTION END ###
[  575s] 
[  575s] lamb16 failed "build osmo-msc_1.3.1.135.17aa.dsc" at Wed Jun  5 03:15:20 UTC 2019.
[  575s] 

-- 
Configure notifications at https://build.opensuse.org/user/notifications
openSUSE Build Service (https://build.opensuse.org/)


More information about the gerrit-log mailing list