Build failure of network:osmocom:nightly/osmo-msc in Debian_Testing/x86_64

OBS Notification admin at opensuse.org
Wed Jun 5 04:28:16 UTC 2019


Visit https://build.opensuse.org/package/live_build_log/network:osmocom:nightly/osmo-msc/Debian_Testing/x86_64

Package network:osmocom:nightly/osmo-msc failed to build in Debian_Testing/x86_64

Check out the package for editing:
  osc checkout network:osmocom:nightly osmo-msc

Last lines of build log:
[  396s] | #define HAVE_STRINGS_H 1
[  396s] | #define HAVE_INTTYPES_H 1
[  396s] | #define HAVE_STDINT_H 1
[  396s] | #define HAVE_UNISTD_H 1
[  396s] | #define HAVE_DLFCN_H 1
[  396s] | #define LT_OBJDIR ".libs/"
[  396s] | #define HAVE_LIBSCTP 1
[  396s] | #define BUILD_SMPP 1
[  396s] | #define BUILD_IU 1
[  396s] | #define STDC_HEADERS 1
[  396s] | #define HAVE_DBI_DBD_H 1
[  396s] | #define HAVE_TM_GMTOFF_IN_TM 1
[  396s] | 
[  396s] | configure: exit 0
[  396s] 
[  396s] make[1]: *** [debian/rules:63: override_dh_auto_test] Error 1
[  396s] make[1]: Leaving directory '/usr/src/packages/BUILD'
[  396s] make: *** [debian/rules:45: build] Error 2
[  396s] dpkg-buildpackage: error: debian/rules build subprocess returned exit status 2
[  396s] 
[  396s] build70 failed "build osmo-msc_1.3.1.135.17aa.dsc" at Wed Jun  5 04:28:04 UTC 2019.
[  396s] 
[  396s] ### VM INTERACTION START ###
[  399s] [  383.041190] sysrq: SysRq : Power Off
[  399s] [  383.049584] reboot: Power down
[  399s] ### VM INTERACTION END ###
[  399s] 
[  399s] build70 failed "build osmo-msc_1.3.1.135.17aa.dsc" at Wed Jun  5 04:28:09 UTC 2019.
[  399s] 

-- 
Configure notifications at https://build.opensuse.org/user/notifications
openSUSE Build Service (https://build.opensuse.org/)


More information about the gerrit-log mailing list