Build failure of network:osmocom:nightly/osmo-msc in Debian_Testing/x86_64

OBS Notification admin at opensuse.org
Tue Jun 4 17:26:38 UTC 2019


Visit https://build.opensuse.org/package/live_build_log/network:osmocom:nightly/osmo-msc/Debian_Testing/x86_64

Package network:osmocom:nightly/osmo-msc failed to build in Debian_Testing/x86_64

Check out the package for editing:
  osc checkout network:osmocom:nightly osmo-msc

Last lines of build log:
[  262s] | #define HAVE_STRINGS_H 1
[  262s] | #define HAVE_INTTYPES_H 1
[  262s] | #define HAVE_STDINT_H 1
[  262s] | #define HAVE_UNISTD_H 1
[  262s] | #define HAVE_DLFCN_H 1
[  262s] | #define LT_OBJDIR ".libs/"
[  262s] | #define HAVE_LIBSCTP 1
[  262s] | #define BUILD_SMPP 1
[  262s] | #define BUILD_IU 1
[  262s] | #define STDC_HEADERS 1
[  262s] | #define HAVE_DBI_DBD_H 1
[  262s] | #define HAVE_TM_GMTOFF_IN_TM 1
[  262s] | 
[  262s] | configure: exit 0
[  262s] 
[  262s] make[1]: *** [debian/rules:63: override_dh_auto_test] Error 1
[  262s] make[1]: Leaving directory '/usr/src/packages/BUILD'
[  262s] make: *** [debian/rules:45: build] Error 2
[  262s] dpkg-buildpackage: error: debian/rules build subprocess returned exit status 2
[  262s] 
[  262s] sheep83 failed "build osmo-msc_1.3.1.133.9d61.dsc" at Tue Jun  4 17:26:29 UTC 2019.
[  262s] 
[  262s] ### VM INTERACTION START ###
[  265s] [  253.308619] sysrq: SysRq : Power Off
[  265s] [  253.314714] reboot: Power down
[  265s] ### VM INTERACTION END ###
[  265s] 
[  265s] sheep83 failed "build osmo-msc_1.3.1.133.9d61.dsc" at Tue Jun  4 17:26:33 UTC 2019.
[  265s] 

-- 
Configure notifications at https://build.opensuse.org/user/notifications
openSUSE Build Service (https://build.opensuse.org/)


More information about the gerrit-log mailing list