Build failure of network:osmocom:nightly/osmo-gsm-manuals in Debian_9.0/aarch64

OBS Notification admin at opensuse.org
Fri Jul 26 02:36:18 UTC 2019


Visit https://build.opensuse.org/package/live_build_log/network:osmocom:nightly/osmo-gsm-manuals/Debian_9.0/aarch64

Package network:osmocom:nightly/osmo-gsm-manuals failed to build in Debian_9.0/aarch64

Check out the package for editing:
  osc checkout network:osmocom:nightly osmo-gsm-manuals

Last lines of build log:
[  217s] asciidoc -v -f ../build/mscgen-filter.conf -f ../build/diag-filter.conf -f ../build/docinfo-releaseinfo.conf -f ../build/python2-filter.conf -a srcdir='.' -a commondir='../common' test-usermanual.adoc > test-usermanual.check 2>&1
[  249s] # Make absolutely sure that the %.check target is updated.
[  249s] touch test-usermanual.check
[  249s] # Do print the WARNING output but return error if any was found
[  249s] # (grep -v would omit the WARNING output from the log).
[  249s] asciidoc: WARNING: mgcp_extension_osmux.adoc: line 2: section title out of sequence: expected level 1, got level 2
[  249s] ../build/Makefile.asciidoc.inc:87: recipe for target 'test-usermanual.check' failed
[  249s] make[3]: *** [test-usermanual.check] Error 1
[  249s] make[3]: Leaving directory '/usr/src/packages/BUILD/tests'
[  249s] Makefile:438: recipe for target 'check-recursive' failed
[  249s] make[2]: *** [check-recursive] Error 1
[  249s] make[2]: Leaving directory '/usr/src/packages/BUILD'
[  249s] Makefile:729: recipe for target 'check' failed
[  249s] make[1]: *** [check] Error 2
[  249s] make[1]: Leaving directory '/usr/src/packages/BUILD'
[  249s] dh_auto_test: make -j1 check VERBOSE=1 returned exit code 2
[  249s] debian/rules:5: recipe for target 'binary' failed
[  249s] make: *** [binary] Error 2
[  249s] dpkg-buildpackage: error: fakeroot debian/rules binary gave error exit status 2
[  249s] 
[  249s] obs-arm-9 failed "build osmo-gsm-manuals-dev_0.1.1.4.c197.dsc" at Fri Jul 26 02:36:07 UTC 2019.
[  249s] 
[  249s] ### VM INTERACTION START ###
[  253s] [  242.037439] sysrq: Power Off
[  253s] [  242.040847] reboot: Power down
[  253s] ### VM INTERACTION END ###
[  253s] 
[  253s] obs-arm-9 failed "build osmo-gsm-manuals-dev_0.1.1.4.c197.dsc" at Fri Jul 26 02:36:10 UTC 2019.
[  253s] 

-- 
Configure notifications at https://build.opensuse.org/user/notifications
openSUSE Build Service (https://build.opensuse.org/)


More information about the gerrit-log mailing list