Build failure of network:osmocom:nightly/osmo-gsm-manuals in xUbuntu_18.10/i586

OBS Notification admin at opensuse.org
Fri Jul 26 02:39:10 UTC 2019


Visit https://build.opensuse.org/package/live_build_log/network:osmocom:nightly/osmo-gsm-manuals/xUbuntu_18.10/i586

Package network:osmocom:nightly/osmo-gsm-manuals failed to build in xUbuntu_18.10/i586

Check out the package for editing:
  osc checkout network:osmocom:nightly osmo-gsm-manuals

Last lines of build log:
[  368s] # same.
[  368s] if ! [ -f test-usermanual.adoc ]; then \
[  368s] 	ln -s test-usermanual.adoc test-usermanual.adoc; \
[  368s] fi
[  368s] asciidoc -v -f ../build/mscgen-filter.conf -f ../build/diag-filter.conf -f ../build/docinfo-releaseinfo.conf -f ../build/python2-filter.conf -a srcdir='.' -a commondir='../common' test-usermanual.adoc > test-usermanual.check 2>&1
[  395s] # Make absolutely sure that the %.check target is updated.
[  395s] touch test-usermanual.check
[  395s] # Do print the WARNING output but return error if any was found
[  395s] # (grep -v would omit the WARNING output from the log).
[  395s] asciidoc: WARNING: mgcp_extension_osmux.adoc: line 2: section title out of sequence: expected level 1, got level 2
[  395s] make[3]: *** [../build/Makefile.asciidoc.inc:96: test-usermanual.check] Error 1
[  395s] make[3]: Leaving directory '/usr/src/packages/BUILD/tests'
[  395s] make[2]: *** [Makefile:438: check-recursive] Error 1
[  395s] make[2]: Leaving directory '/usr/src/packages/BUILD'
[  395s] make[1]: *** [Makefile:732: check] Error 2
[  395s] make[1]: Leaving directory '/usr/src/packages/BUILD'
[  395s] dh_auto_test: make -j1 check VERBOSE=1 returned exit code 2
[  395s] make: *** [debian/rules:5: binary] Error 2
[  395s] dpkg-buildpackage: error: fakeroot debian/rules binary subprocess returned exit status 2
[  395s] 
[  395s] lamb26 failed "build osmo-gsm-manuals-dev_0.1.1.4.c197.dsc" at Fri Jul 26 02:39:00 UTC 2019.
[  395s] 
[  395s] ### VM INTERACTION START ###
[  398s] [  382.053306] sysrq: SysRq : Power Off
[  398s] [  382.058427] reboot: Power down
[  398s] ### VM INTERACTION END ###
[  398s] 
[  398s] lamb26 failed "build osmo-gsm-manuals-dev_0.1.1.4.c197.dsc" at Fri Jul 26 02:39:04 UTC 2019.
[  398s] 

-- 
Configure notifications at https://build.opensuse.org/user/notifications
openSUSE Build Service (https://build.opensuse.org/)


More information about the gerrit-log mailing list