Build failure of network:osmocom:nightly/osmo-bts in Debian_8.0/x86_64

OBS Notification admin at opensuse.org
Tue Jul 9 02:48:07 UTC 2019


Visit https://build.opensuse.org/package/live_build_log/network:osmocom:nightly/osmo-bts/Debian_8.0/x86_64

Package network:osmocom:nightly/osmo-bts failed to build in Debian_8.0/x86_64

Check out the package for editing:
  osc checkout network:osmocom:nightly osmo-bts

Last lines of build log:
[  308s] measurement.c:448:1: warning: control reaches end of non-void function [-Wreturn-type]
[  308s]  }
[  308s]  ^
[  308s] Makefile:426: recipe for target 'measurement.o' failed
[  308s] make[4]: *** [measurement.o] Error 1
[  308s] make[4]: Leaving directory '/usr/src/packages/BUILD/src/common'
[  308s] Makefile:373: recipe for target 'all-recursive' failed
[  308s] make[3]: *** [all-recursive] Error 1
[  308s] make[3]: Leaving directory '/usr/src/packages/BUILD/src'
[  308s] Makefile:422: recipe for target 'all-recursive' failed
[  308s] make[2]: *** [all-recursive] Error 1
[  308s] make[2]: Leaving directory '/usr/src/packages/BUILD'
[  308s] Makefile:353: recipe for target 'all' failed
[  308s] make[1]: *** [all] Error 2
[  308s] make[1]: Leaving directory '/usr/src/packages/BUILD'
[  308s] dh_auto_build: make -j1 returned exit code 2
[  308s] debian/rules:12: recipe for target 'build' failed
[  308s] make: *** [build] Error 2
[  308s] dpkg-buildpackage: error: debian/rules build gave error exit status 2
[  308s] 
[  308s] lamb52 failed "build osmo-bts_0.8.1.335.7d1d.dsc" at Tue Jul  9 02:47:50 UTC 2019.
[  308s] 
[  308s] ### VM INTERACTION START ###
[  309s] Powering off.
[  309s] [  291.534457] reboot: Power down
[  309s] ### VM INTERACTION END ###
[  310s] 
[  310s] lamb52 failed "build osmo-bts_0.8.1.335.7d1d.dsc" at Tue Jul  9 02:47:53 UTC 2019.
[  310s] 

-- 
Configure notifications at https://build.opensuse.org/user/notifications
openSUSE Build Service (https://build.opensuse.org/)


More information about the gerrit-log mailing list