Build failure of network:osmocom:nightly/osmo-bts in Debian_8.0/i586

OBS Notification admin at opensuse.org
Tue Jul 9 02:46:59 UTC 2019


Visit https://build.opensuse.org/package/live_build_log/network:osmocom:nightly/osmo-bts/Debian_8.0/i586

Package network:osmocom:nightly/osmo-bts failed to build in Debian_8.0/i586

Check out the package for editing:
  osc checkout network:osmocom:nightly osmo-bts

Last lines of build log:
[  174s] measurement.c:448:1: warning: control reaches end of non-void function [-Wreturn-type]
[  174s]  }
[  174s]  ^
[  174s] Makefile:426: recipe for target 'measurement.o' failed
[  174s] make[4]: *** [measurement.o] Error 1
[  174s] make[4]: Leaving directory '/usr/src/packages/BUILD/src/common'
[  174s] Makefile:373: recipe for target 'all-recursive' failed
[  174s] make[3]: *** [all-recursive] Error 1
[  174s] make[3]: Leaving directory '/usr/src/packages/BUILD/src'
[  174s] Makefile:422: recipe for target 'all-recursive' failed
[  174s] make[2]: *** [all-recursive] Error 1
[  174s] make[2]: Leaving directory '/usr/src/packages/BUILD'
[  174s] Makefile:353: recipe for target 'all' failed
[  174s] make[1]: *** [all] Error 2
[  174s] make[1]: Leaving directory '/usr/src/packages/BUILD'
[  174s] dh_auto_build: make -j1 returned exit code 2
[  174s] debian/rules:12: recipe for target 'build' failed
[  174s] make: *** [build] Error 2
[  174s] dpkg-buildpackage: error: debian/rules build gave error exit status 2
[  174s] 
[  174s] lamb06 failed "build osmo-bts_0.8.1.335.7d1d.dsc" at Tue Jul  9 02:46:41 UTC 2019.
[  174s] 
[  174s] ### VM INTERACTION START ###
[  175s] Powering off.
[  175s] [  160.186264] reboot: Power down
[  175s] ### VM INTERACTION END ###
[  175s] 
[  175s] lamb06 failed "build osmo-bts_0.8.1.335.7d1d.dsc" at Tue Jul  9 02:46:43 UTC 2019.
[  175s] 

-- 
Configure notifications at https://build.opensuse.org/user/notifications
openSUSE Build Service (https://build.opensuse.org/)


More information about the gerrit-log mailing list