Build failure of network:osmocom:nightly/osmo-bts in Debian_9.0/i586

OBS Notification admin at opensuse.org
Tue Jul 9 02:48:24 UTC 2019


Visit https://build.opensuse.org/package/live_build_log/network:osmocom:nightly/osmo-bts/Debian_9.0/i586

Package network:osmocom:nightly/osmo-bts failed to build in Debian_9.0/i586

Check out the package for editing:
  osc checkout network:osmocom:nightly osmo-bts

Last lines of build log:
[  309s] measurement.c:448:1: warning: control reaches end of non-void function [-Wreturn-type]
[  309s]  }
[  309s]  ^
[  309s] Makefile:437: recipe for target 'measurement.o' failed
[  309s] make[4]: *** [measurement.o] Error 1
[  309s] make[4]: Leaving directory '/usr/src/packages/BUILD/src/common'
[  310s] Makefile:385: recipe for target 'all-recursive' failed
[  310s] make[3]: *** [all-recursive] Error 1
[  310s] make[3]: Leaving directory '/usr/src/packages/BUILD/src'
[  310s] Makefile:434: recipe for target 'all-recursive' failed
[  310s] make[2]: *** [all-recursive] Error 1
[  310s] make[2]: Leaving directory '/usr/src/packages/BUILD'
[  310s] Makefile:366: recipe for target 'all' failed
[  310s] make[1]: *** [all] Error 2
[  310s] make[1]: Leaving directory '/usr/src/packages/BUILD'
[  310s] dh_auto_build: make -j1 returned exit code 2
[  310s] debian/rules:12: recipe for target 'build' failed
[  310s] make: *** [build] Error 2
[  310s] dpkg-buildpackage: error: debian/rules build gave error exit status 2
[  310s] 
[  310s] lamb22 failed "build osmo-bts_0.8.1.335.7d1d.dsc" at Tue Jul  9 02:48:16 UTC 2019.
[  310s] 
[  310s] ### VM INTERACTION START ###
[  313s] [  286.573090] sysrq: SysRq : Power Off
[  313s] [  286.590589] reboot: Power down
[  313s] ### VM INTERACTION END ###
[  313s] 
[  313s] lamb22 failed "build osmo-bts_0.8.1.335.7d1d.dsc" at Tue Jul  9 02:48:21 UTC 2019.
[  313s] 

-- 
Configure notifications at https://build.opensuse.org/user/notifications
openSUSE Build Service (https://build.opensuse.org/)


More information about the gerrit-log mailing list