Build failed in Jenkins: master-openbsc » --disable-iu,--disable-mgcp-transcoding,--enable-smpp,default,osmocom-master-debian9 #4123

This is merely a historical archive of years 2008-2021, before the migration to mailman3.

A maintained and still updated list archive can be found at https://lists.osmocom.org/hyperkitty/list/jenkins-notifications@lists.osmocom.org/.

jenkins at lists.osmocom.org jenkins at lists.osmocom.org
Thu Mar 21 00:59:40 UTC 2019


See <https://jenkins.osmocom.org/jenkins/job/master-openbsc/IU=--disable-iu,MGCP=--disable-mgcp-transcoding,SMPP=--enable-smpp,a4=default,label=osmocom-master-debian9/4123/display/redirect>

------------------------------------------
[...truncated 883.40 KB...]
MSC got connection from  ('127.0.0.1', 36050)
'show msc connection' says: 'MSC is connected: 1'
BSC0 
	connected to 127.0.0.1:5000
	proc.poll() = None
	proc.pid = 5830
	BSC <- NAT: IPA ID ACK
	sending IPA identity(lol) at 00:59:38
	done sending IPA identity(lol) at 00:59:38
	proc.poll() = None
	proc.poll() = None
ERROR
Socket: closing 127.0.0.1:4244 <socket._socketobject object at 0x7f29793ac9f0> (0 sockets open)
testEnsureNoEnsureModeSet (__main__.TestVTYNAT) ... Launching: PWD=/build/openbsc './src/osmo-bsc_nat/osmo-bsc_nat' '-l' '127.0.0.1' '-c' '/build/openbsc/tests/../doc/examples/osmo-bsc_nat/osmo-bsc-nat.cfg'

> ls -l /proc/5569/fd
total 0
lr-x------ 1 build build 64 Mar 21 00:58 0 -> pipe:[3105507494]
l-wx------ 1 build build 64 Mar 21 00:58 1 -> pipe:[3105507495]
l-wx------ 1 build build 64 Mar 21 00:58 2 -> pipe:[3105507496]
l-wx------ 1 build build 64 Mar 21 00:58 3 -> /dev/null
lr-x------ 1 build build 64 Mar 21 00:58 5 -> /dev/urandom


> ss -tn
State      Recv-Q Send-Q        Local Address:Port          Peer Address:Port 


> ss -tln
State      Recv-Q Send-Q        Local Address:Port          Peer Address:Port 
LISTEN     0      1                         *:5001                     *:*     
LISTEN     0      10                127.0.0.1:4244                     *:*     
LISTEN     0      10                127.0.0.1:4250                     *:*     
LISTEN     0      1                 127.0.0.1:5000                     *:*     


> ps xua | grep osmo
build     5840  0.0  0.0  48240  5468 ?        S    00:59   0:00 ./src/osmo-bsc_nat/osmo-bsc_nat -l 127.0.0.1 -c /build/openbsc/tests/../doc/examples/osmo-bsc_nat/osmo-bsc-nat.cfg
build     5847  0.0  0.0   4336   728 ?        S    00:59   0:00 /bin/sh -c ps xua | grep osmo
build     5849  0.0  0.0  12728  2120 ?        S    00:59   0:00 grep osmo

Socket: in 1 tries, connected to 127.0.0.1:4244 <socket._socketobject object at 0x7f29793acb40> (1 sockets open)
Socket: closing 127.0.0.1:4244 <socket._socketobject object at 0x7f29793acb40> (0 sockets open)
ok
testPrefixTreeLoading (__main__.TestVTYNAT) ... Launching: PWD=/build/openbsc './src/osmo-bsc_nat/osmo-bsc_nat' '-l' '127.0.0.1' '-c' '/build/openbsc/tests/../doc/examples/osmo-bsc_nat/osmo-bsc-nat.cfg'

> ls -l /proc/5569/fd
total 0
lr-x------ 1 build build 64 Mar 21 00:58 0 -> pipe:[3105507494]
l-wx------ 1 build build 64 Mar 21 00:58 1 -> pipe:[3105507495]
l-wx------ 1 build build 64 Mar 21 00:58 2 -> pipe:[3105507496]
l-wx------ 1 build build 64 Mar 21 00:58 3 -> /dev/null
lr-x------ 1 build build 64 Mar 21 00:58 5 -> /dev/urandom


> ss -tn
State      Recv-Q Send-Q        Local Address:Port          Peer Address:Port 


> ss -tln
State      Recv-Q Send-Q        Local Address:Port          Peer Address:Port 
LISTEN     0      1                         *:5001                     *:*     
LISTEN     0      10                127.0.0.1:4244                     *:*     
LISTEN     0      10                127.0.0.1:4250                     *:*     
LISTEN     0      1                 127.0.0.1:5000                     *:*     


> ps xua | grep osmo
build     5850  0.0  0.0  48240  5476 ?        S    00:59   0:00 ./src/osmo-bsc_nat/osmo-bsc_nat -l 127.0.0.1 -c /build/openbsc/tests/../doc/examples/osmo-bsc_nat/osmo-bsc-nat.cfg
build     5857  0.0  0.0   4336   760 ?        S    00:59   0:00 /bin/sh -c ps xua | grep osmo
build     5859  0.0  0.0  12728  2248 ?        S    00:59   0:00 grep osmo

Socket: in 1 tries, connected to 127.0.0.1:4244 <socket._socketobject object at 0x7f29793acb40> (1 sockets open)
Socket: closing 127.0.0.1:4244 <socket._socketobject object at 0x7f29793acb40> (0 sockets open)
ok
testRewriteNoRewrite (__main__.TestVTYNAT) ... Launching: PWD=/build/openbsc './src/osmo-bsc_nat/osmo-bsc_nat' '-l' '127.0.0.1' '-c' '/build/openbsc/tests/../doc/examples/osmo-bsc_nat/osmo-bsc-nat.cfg'

> ls -l /proc/5569/fd
total 0
lr-x------ 1 build build 64 Mar 21 00:58 0 -> pipe:[3105507494]
l-wx------ 1 build build 64 Mar 21 00:58 1 -> pipe:[3105507495]
l-wx------ 1 build build 64 Mar 21 00:58 2 -> pipe:[3105507496]
l-wx------ 1 build build 64 Mar 21 00:58 3 -> /dev/null
lr-x------ 1 build build 64 Mar 21 00:58 5 -> /dev/urandom


> ss -tn
State      Recv-Q Send-Q        Local Address:Port          Peer Address:Port 


> ss -tln
State      Recv-Q Send-Q        Local Address:Port          Peer Address:Port 
LISTEN     0      1                         *:5001                     *:*     
LISTEN     0      10                127.0.0.1:4244                     *:*     
LISTEN     0      10                127.0.0.1:4250                     *:*     
LISTEN     0      1                 127.0.0.1:5000                     *:*     


> ps xua | grep osmo
build     5860  1.0  0.0  48240  5552 ?        S    00:59   0:00 ./src/osmo-bsc_nat/osmo-bsc_nat -l 127.0.0.1 -c /build/openbsc/tests/../doc/examples/osmo-bsc_nat/osmo-bsc-nat.cfg
build     5867  0.0  0.0   4336   768 ?        S    00:59   0:00 /bin/sh -c ps xua | grep osmo
build     5869  0.0  0.0  12728  2244 ?        S    00:59   0:00 grep osmo

Socket: in 1 tries, connected to 127.0.0.1:4244 <socket._socketobject object at 0x7f29793acb40> (1 sockets open)
Socket: closing 127.0.0.1:4244 <socket._socketobject object at 0x7f29793acb40> (0 sockets open)
ok
testRewritePostNoRewrite (__main__.TestVTYNAT) ... Launching: PWD=/build/openbsc './src/osmo-bsc_nat/osmo-bsc_nat' '-l' '127.0.0.1' '-c' '/build/openbsc/tests/../doc/examples/osmo-bsc_nat/osmo-bsc-nat.cfg'

> ls -l /proc/5569/fd
total 0
lr-x------ 1 build build 64 Mar 21 00:58 0 -> pipe:[3105507494]
l-wx------ 1 build build 64 Mar 21 00:58 1 -> pipe:[3105507495]
l-wx------ 1 build build 64 Mar 21 00:58 2 -> pipe:[3105507496]
l-wx------ 1 build build 64 Mar 21 00:58 3 -> /dev/null
lr-x------ 1 build build 64 Mar 21 00:58 5 -> /dev/urandom


> ss -tn
State      Recv-Q Send-Q        Local Address:Port          Peer Address:Port 


> ss -tln
State      Recv-Q Send-Q        Local Address:Port          Peer Address:Port 
LISTEN     0      1                         *:5001                     *:*     
LISTEN     0      10                127.0.0.1:4244                     *:*     
LISTEN     0      10                127.0.0.1:4250                     *:*     
LISTEN     0      1                 127.0.0.1:5000                     *:*     


> ps xua | grep osmo
build     5870  0.0  0.0  48240  5476 ?        S    00:59   0:00 ./src/osmo-bsc_nat/osmo-bsc_nat -l 127.0.0.1 -c /build/openbsc/tests/../doc/examples/osmo-bsc_nat/osmo-bsc-nat.cfg
build     5877  0.0  0.0   4336   768 ?        S    00:59   0:00 /bin/sh -c ps xua | grep osmo
build     5879  0.0  0.0  12728  2108 ?        S    00:59   0:00 grep osmo

Socket: in 1 tries, connected to 127.0.0.1:4244 <socket._socketobject object at 0x7f29793acb40> (1 sockets open)
Socket: closing 127.0.0.1:4244 <socket._socketobject object at 0x7f29793acb40> (0 sockets open)
ok
testUssdSideChannelProvider (__main__.TestVTYNAT) ... Launching: PWD=/build/openbsc './src/osmo-bsc_nat/osmo-bsc_nat' '-l' '127.0.0.1' '-c' '/build/openbsc/tests/../doc/examples/osmo-bsc_nat/osmo-bsc-nat.cfg'

> ls -l /proc/5569/fd
total 0
lr-x------ 1 build build 64 Mar 21 00:58 0 -> pipe:[3105507494]
l-wx------ 1 build build 64 Mar 21 00:58 1 -> pipe:[3105507495]
l-wx------ 1 build build 64 Mar 21 00:58 2 -> pipe:[3105507496]
l-wx------ 1 build build 64 Mar 21 00:58 3 -> /dev/null
lr-x------ 1 build build 64 Mar 21 00:58 5 -> /dev/urandom


> ss -tn
State      Recv-Q Send-Q        Local Address:Port          Peer Address:Port 


> ss -tln
State      Recv-Q Send-Q        Local Address:Port          Peer Address:Port 
LISTEN     0      1                         *:5001                     *:*     
LISTEN     0      10                127.0.0.1:4244                     *:*     
LISTEN     0      10                127.0.0.1:4250                     *:*     
LISTEN     0      1                 127.0.0.1:5000                     *:*     


> ps xua | grep osmo
build     5880  0.0  0.0  48240  5516 ?        S    00:59   0:00 ./src/osmo-bsc_nat/osmo-bsc_nat -l 127.0.0.1 -c /build/openbsc/tests/../doc/examples/osmo-bsc_nat/osmo-bsc-nat.cfg
build     5887  0.0  0.0   4336   812 ?        S    00:59   0:00 /bin/sh -c ps xua | grep osmo
build     5889  0.0  0.0  12728  2236 ?        S    00:59   0:00 grep osmo

Socket: in 1 tries, connected to 127.0.0.1:4244 <socket._socketobject object at 0x7f29793acb40> (1 sockets open)
Connected to 127.0.0.1:5001
Expecting ID_GET request
Going to send ID_RESP response
Going to send PING request
Expecting PONG response
ERROR
Socket: closing 127.0.0.1:4244 <socket._socketobject object at 0x7f29793acb40> (0 sockets open)
testVtyTree (__main__.TestVTYNAT) ... Launching: PWD=/build/openbsc './src/osmo-bsc_nat/osmo-bsc_nat' '-l' '127.0.0.1' '-c' '/build/openbsc/tests/../doc/examples/osmo-bsc_nat/osmo-bsc-nat.cfg'

> ls -l /proc/5569/fd
total 0
lr-x------ 1 build build 64 Mar 21 00:58 0 -> pipe:[3105507494]
l-wx------ 1 build build 64 Mar 21 00:58 1 -> pipe:[3105507495]
l-wx------ 1 build build 64 Mar 21 00:58 2 -> pipe:[3105507496]
l-wx------ 1 build build 64 Mar 21 00:58 3 -> /dev/null
lr-x------ 1 build build 64 Mar 21 00:58 5 -> /dev/urandom


> ss -tn
State      Recv-Q Send-Q        Local Address:Port          Peer Address:Port 


> ss -tln
State      Recv-Q Send-Q        Local Address:Port          Peer Address:Port 
LISTEN     0      1                         *:5001                     *:*     
LISTEN     0      10                127.0.0.1:4244                     *:*     
LISTEN     0      10                127.0.0.1:4250                     *:*     
LISTEN     0      1                 127.0.0.1:5000                     *:*     


> ps xua | grep osmo
build     5890  0.0  0.0  48240  5472 ?        S    00:59   0:00 ./src/osmo-bsc_nat/osmo-bsc_nat -l 127.0.0.1 -c /build/openbsc/tests/../doc/examples/osmo-bsc_nat/osmo-bsc-nat.cfg
build     5897  0.0  0.0   4336   804 ?        S    00:59   0:00 /bin/sh -c ps xua | grep osmo
build     5899  0.0  0.0  12728  2056 ?        S    00:59   0:00 grep osmo

Socket: in 1 tries, connected to 127.0.0.1:4244 <socket._socketobject object at 0x7f29793acad0> (1 sockets open)
Socket: closing 127.0.0.1:4244 <socket._socketobject object at 0x7f29793acad0> (0 sockets open)
ok

======================================================================
ERROR: testBSCreload (__main__.TestVTYNAT)
----------------------------------------------------------------------
Traceback (most recent call last):
  File "./vty_test_runner.py", line 803, in testBSCreload
    b0 = nat_bsc_sock_test(0, "lol", verbose=True, proc=self.proc)
  File "./vty_test_runner.py", line 1112, in nat_bsc_sock_test
    ipa_handle_small(bsc, verbose)
  File "./vty_test_runner.py", line 1052, in ipa_handle_small
    raise Exception("expected to receive 4 bytes, but got %d (%r)" % (len(s)/2, s))
Exception: expected to receive 4 bytes, but got 0 ('')

======================================================================
ERROR: testUssdSideChannelProvider (__main__.TestVTYNAT)
----------------------------------------------------------------------
Traceback (most recent call last):
  File "./vty_test_runner.py", line 935, in testUssdSideChannelProvider
    data = ussdSocket.recv(4)
error: [Errno 104] Connection reset by peer

----------------------------------------------------------------------
Ran 33 tests in 85.785s

FAILED (errors=2)
make[5]: *** [python-tests] Error 2
Makefile:714: recipe for target 'python-tests' failed
make[5]: Leaving directory '/build/openbsc/tests'
make[4]: *** [check-local] Error 2
Makefile:724: recipe for target 'check-local' failed
make[4]: Leaving directory '/build/openbsc/tests'
make[3]: *** [check-am] Error 2
Makefile:576: recipe for target 'check-am' failed
make[3]: Leaving directory '/build/openbsc/tests'
Makefile:428: recipe for target 'check-recursive' failed
make[2]: Leaving directory '/build/openbsc/tests'
make[2]: *** [check-recursive] Error 1
Makefile:458: recipe for target 'check-recursive' failed
make[1]: Leaving directory '/build/openbsc'
make[1]: *** [check-recursive] Error 1
Makefile:749: recipe for target 'check' failed
make: *** [check] Error 2
+ cat-testlogs.sh
Build step 'Execute shell' marked build as failure
[WARNINGS]Skipping publisher since build result is FAILURE



More information about the jenkins-notifications mailing list