Build failed in Jenkins: master-osmo-sgsn » --enable-iu,0,a3=default,a4=default,osmocom-master-debian9 #9907

This is merely a historical archive of years 2008-2021, before the migration to mailman3.

A maintained and still updated list archive can be found at https://lists.osmocom.org/hyperkitty/list/jenkins-notifications@lists.osmocom.org/.

jenkins at lists.osmocom.org jenkins at lists.osmocom.org
Mon Apr 8 01:09:53 UTC 2019


See <https://jenkins.osmocom.org/jenkins/job/master-osmo-sgsn/IU=--enable-iu,WITH_MANUALS=0,a3=default,a4=default,label=osmocom-master-debian9/9907/display/redirect>

------------------------------------------
[...truncated 835.94 KB...]
                ^
../../include/osmocom/ranap/RANAP_CriticalityDiagnostics-IE-List.h:28:2: note: in expansion of macro 'A_SEQUENCE_OF'
  A_SEQUENCE_OF(struct MemberG {
  ^
../../include/osmocom/ranap/RANAP_CriticalityDiagnostics-IE-List.h:28:23: warning: its scope is only this definition or declaration, which is probably not what you want
  A_SEQUENCE_OF(struct MemberG {
                       ^
/build/deps/install/stow/libasn1c/include/asn1c/asn_SET_OF.h:17:16: note: in definition of macro 'A_SET_OF'
   void (*free)(type *);   \
                ^
../../include/osmocom/ranap/RANAP_CriticalityDiagnostics-IE-List.h:28:2: note: in expansion of macro 'A_SEQUENCE_OF'
  A_SEQUENCE_OF(struct MemberG {
  ^
  CC       RANAP_MessageStructure.lo
  CC       RANAP_CGI.lo
  CC       RANAP_ChosenEncryptionAlgorithm.lo
  CC       RANAP_ChosenIntegrityProtectionAlgorithm.lo
In file included from /build/deps/install/stow/libasn1c/include/asn1c/asn_SEQUENCE_OF.h:8:0,
                 from ../../include/osmocom/ranap/RANAP_CriticalityDiagnostics-IE-List.h:14,
                 from RANAP_CriticalityDiagnostics-IE-List.c:7:
../../include/osmocom/ranap/RANAP_CriticalityDiagnostics-IE-List.h:28:23: warning: 'struct MemberG' declared inside parameter list
  A_SEQUENCE_OF(struct MemberG {
                       ^
/build/deps/install/stow/libasn1c/include/asn1c/asn_SET_OF.h:17:16: note: in definition of macro 'A_SET_OF'
   void (*free)(type *);   \
                ^
../../include/osmocom/ranap/RANAP_CriticalityDiagnostics-IE-List.h:28:2: note: in expansion of macro 'A_SEQUENCE_OF'
  A_SEQUENCE_OF(struct MemberG {
  ^
../../include/osmocom/ranap/RANAP_CriticalityDiagnostics-IE-List.h:28:23: warning: its scope is only this definition or declaration, which is probably not what you want
  A_SEQUENCE_OF(struct MemberG {
                       ^
/build/deps/install/stow/libasn1c/include/asn1c/asn_SET_OF.h:17:16: note: in definition of macro 'A_SET_OF'
   void (*free)(type *);   \
                ^
../../include/osmocom/ranap/RANAP_CriticalityDiagnostics-IE-List.h:28:2: note: in expansion of macro 'A_SEQUENCE_OF'
  A_SEQUENCE_OF(struct MemberG {
  ^
  CC       RANAP_CI.lo
In file included from /build/deps/install/stow/libasn1c/include/asn1c/asn_SEQUENCE_OF.h:8:0,
                 from ../../include/osmocom/ranap/RANAP_MessageStructure.h:14,
                 from RANAP_MessageStructure.c:7:
../../include/osmocom/ranap/RANAP_MessageStructure.h:27:23: warning: 'struct MemberL' declared inside parameter list
  A_SEQUENCE_OF(struct MemberL {
                       ^
/build/deps/install/stow/libasn1c/include/asn1c/asn_SET_OF.h:17:16: note: in definition of macro 'A_SET_OF'
   void (*free)(type *);   \
                ^
../../include/osmocom/ranap/RANAP_MessageStructure.h:27:2: note: in expansion of macro 'A_SEQUENCE_OF'
  A_SEQUENCE_OF(struct MemberL {
  ^
../../include/osmocom/ranap/RANAP_MessageStructure.h:27:23: warning: its scope is only this definition or declaration, which is probably not what you want
  A_SEQUENCE_OF(struct MemberL {
                       ^
/build/deps/install/stow/libasn1c/include/asn1c/asn_SET_OF.h:17:16: note: in definition of macro 'A_SET_OF'
   void (*free)(type *);   \
                ^
../../include/osmocom/ranap/RANAP_MessageStructure.h:27:2: note: in expansion of macro 'A_SEQUENCE_OF'
  A_SEQUENCE_OF(struct MemberL {
  ^
  CC       RANAP_ClassmarkInformation2.lo
  CC       RANAP_ClassmarkInformation3.lo
  CC       RANAP_CN-DomainIndicator.lo
  CC       RANAP_CN-ID.lo
  CC       RANAP_Correlation-ID.lo
  CC       RANAP_CSFB-Information.lo
  CC       RANAP_CSG-Id.lo
  CC       RANAP_CSG-Id-List.lo
  CC       RANAP_CSG-Membership-Status.lo
  CC       RANAP_DataPDUType.lo
  CC       RANAP_DataVolumeReference.lo
  CC       RANAP_DataVolumeReportingIndication.lo
  CC       RANAP_DCH-ID.lo
  CC       RANAP_DeliveryOfErroneousSDU.lo
  CC       RANAP_DeliveryOrder.lo
  CC       RANAP_DeltaRAListofIdleModeUEs.lo
  CC       RANAP_NewRAListofIdleModeUEs.lo
  CC       RANAP_RAListwithNoIdleModeUEsAnyMore.lo
  CC       RANAP_ForwardingIndication.lo
  CC       RANAP_DL-GTP-PDU-SequenceNumber.lo
  CC       RANAP_DL-N-PDU-SequenceNumber.lo
  CC       RANAP_D-RNTI.lo
  CC       RANAP_DRX-CycleLengthCoefficient.lo
  CC       RANAP_DSCH-ID.lo
  CC       RANAP_EARFCN-Extended.lo
  CC       RANAP_E-DCH-MAC-d-Flow-ID.lo
  CC       RANAP_ENB-ID.lo
  CC       RANAP_EncryptionAlgorithm.lo
  CC       RANAP_EncryptionInformation.lo
  CC       RANAP_EncryptionKey.lo
  CC       RANAP_End-Of-CSFB.lo
  CC       RANAP_EquipmentsToBeTraced.lo
  CC       RANAP_E-UTRAN-Service-Handover.lo
  CC       RANAP_Event.lo
  CC       RANAP_Event1F-Parameters.lo
  CC       RANAP_Event1I-Parameters.lo
  CC       RANAP_ExtendedMaxBitrate.lo
  CC       RANAP_ExtendedGuaranteedBitrate.lo
  CC       RANAP_ExtendedRNC-ID.lo
  CC       RANAP_FrameSequenceNumber.lo
  CC       RANAP_FrequenceLayerConvergenceFlag.lo
  CC       RANAP_GANSS-PositioningDataSet.lo
  CC       RANAP_GANSS-PositioningMethodAndUsage.lo
  CC       RANAP_GeographicalArea.lo
  CC       RANAP_GeographicalCoordinates.lo
  CC       RANAP_GA-AltitudeAndDirection.lo
In file included from /build/deps/install/stow/libasn1c/include/asn1c/asn_SEQUENCE_OF.h:8:0,
                 from ../../include/osmocom/ranap/RANAP_IE-Extensions.h:15,
                 from ../../include/osmocom/ranap/RANAP_GeographicalCoordinates.h:16,
                 from ../../include/osmocom/ranap/RANAP_GA-Point.h:14,
                 from ../../include/osmocom/ranap/RANAP_GeographicalArea.h:14,
                 from RANAP_GeographicalArea.c:7:
../../include/osmocom/ranap/RANAP_GA-Polygon.h:26:23: warning: 'struct Member' declared inside parameter list
  A_SEQUENCE_OF(struct Member {
                       ^
/build/deps/install/stow/libasn1c/include/asn1c/asn_SET_OF.h:17:16: note: in definition of macro 'A_SET_OF'
   void (*free)(type *);   \
                ^
../../include/osmocom/ranap/RANAP_GA-Polygon.h:26:2: note: in expansion of macro 'A_SEQUENCE_OF'
  A_SEQUENCE_OF(struct Member {
  ^
../../include/osmocom/ranap/RANAP_GA-Polygon.h:26:23: warning: its scope is only this definition or declaration, which is probably not what you want
  A_SEQUENCE_OF(struct Member {
                       ^
/build/deps/install/stow/libasn1c/include/asn1c/asn_SET_OF.h:17:16: note: in definition of macro 'A_SET_OF'
   void (*free)(type *);   \
                ^
../../include/osmocom/ranap/RANAP_GA-Polygon.h:26:2: note: in expansion of macro 'A_SEQUENCE_OF'
  A_SEQUENCE_OF(struct Member {
  ^
  CC       RANAP_GA-Point.lo
  CC       RANAP_GA-PointWithAltitude.lo
  CC       RANAP_GA-EllipsoidArc.lo
  CC       RANAP_GA-PointWithAltitudeAndUncertaintyEllipsoid.lo
  CC       RANAP_GA-PointWithUnCertainty.lo
  CC       RANAP_GA-PointWithUnCertaintyEllipse.lo
  CC       RANAP_GA-Polygon.lo
  CC       RANAP_GA-UncertaintyEllipse.lo
  CC       RANAP_GERAN-BSC-Container.lo
  CC       RANAP_GERAN-Classmark.lo
  CC       RANAP_GERAN-Cell-ID.lo
  CC       RANAP_GlobalCN-ID.lo
  CC       RANAP_GlobalRNC-ID.lo
  CC       RANAP_GTP-TEI.lo
In file included from /build/deps/install/stow/libasn1c/include/asn1c/asn_SEQUENCE_OF.h:8:0,
                 from ../../include/osmocom/ranap/RANAP_GA-Polygon.h:14,
                 from RANAP_GA-Polygon.c:7:
../../include/osmocom/ranap/RANAP_GA-Polygon.h:26:23: warning: 'struct Member' declared inside parameter list
  A_SEQUENCE_OF(struct Member {
                       ^
/build/deps/install/stow/libasn1c/include/asn1c/asn_SET_OF.h:17:16: note: in definition of macro 'A_SET_OF'
   void (*free)(type *);   \
                ^
../../include/osmocom/ranap/RANAP_GA-Polygon.h:26:2: note: in expansion of macro 'A_SEQUENCE_OF'
  A_SEQUENCE_OF(struct Member {
  ^
../../include/osmocom/ranap/RANAP_GA-Polygon.h:26:23: warning: its scope is only this definition or declaration, which is probably not what you want
  A_SEQUENCE_OF(struct Member {
                       ^
/build/deps/install/stow/libasn1c/include/asn1c/asn_SET_OF.h:17:16: note: in definition of macro 'A_SET_OF'
   void (*free)(type *);   \
                ^
../../include/osmocom/ranap/RANAP_GA-Polygon.h:26:2: note: in expansion of macro 'A_SEQUENCE_OF'
  A_SEQUENCE_OF(struct Member {
  ^
  CC       RANAP_GuaranteedBitrate.lo
  CC       RANAP_HigherBitratesThan16MbpsFlag.lo
  CC       RANAP_HS-DSCH-MAC-d-Flow-ID.lo
  CC       RANAP_IMEIGroup.lo
  CC       RANAP_IMEI.lo
  CC       RANAP_IMEIList.lo
  CC       RANAP_IMEISV.lo
  CC       RANAP_IMEISVGroup.lo
  CC       RANAP_IMEISVList.lo
  CC       RANAP_ImmediateMDT.lo
  CC       RANAP_IMSI.lo
  CC       RANAP_IncludeVelocity.lo
  CC       RANAP_InformationExchangeID.lo
  CC       RANAP_InformationExchangeType.lo
  CC       RANAP_InformationRequested.lo
  CC       RANAP_InformationRequestType.lo
  CC       RANAP_InformationTransferID.lo
  CC       RANAP_InformationTransferType.lo
  CC       RANAP_IntegrityProtectionAlgorithm.lo
  CC       RANAP_IntegrityProtectionInformation.lo
  CC       RANAP_IntegrityProtectionKey.lo
  CC       RANAP_InterSystemInformationTransferType.lo
  CC       RANAP_InterSystemInformation-TransparentContainer.lo
  CC       RANAP_IPMulticastAddress.lo
  CC       RANAP_IuSignallingConnectionIdentifier.lo
  CC       RANAP_IuTransportAssociation.lo
  CC       RANAP_KeyStatus.lo
  CC       RANAP_LA-LIST.lo
  CC       RANAP_LAC.lo
  CC       RANAP_LAI.lo
  CC       RANAP_LastKnownServiceArea.lo
  CC       RANAP_LastVisitedUTRANCell-Item.lo
In file included from /build/deps/install/stow/libasn1c/include/asn1c/asn_SEQUENCE_OF.h:8:0,
                 from ../../include/osmocom/ranap/RANAP_LA-LIST.h:14,
                 from RANAP_LA-LIST.c:7:
../../include/osmocom/ranap/RANAP_LA-LIST.h:27:23: warning: 'struct MemberA' declared inside parameter list
  A_SEQUENCE_OF(struct MemberA {
                       ^
/build/deps/install/stow/libasn1c/include/asn1c/asn_SET_OF.h:17:16: note: in definition of macro 'A_SET_OF'
   void (*free)(type *);   \
                ^
../../include/osmocom/ranap/RANAP_LA-LIST.h:27:2: note: in expansion of macro 'A_SEQUENCE_OF'
  A_SEQUENCE_OF(struct MemberA {
  ^
../../include/osmocom/ranap/RANAP_LA-LIST.h:27:23: warning: its scope is only this definition or declaration, which is probably not what you want
  A_SEQUENCE_OF(struct MemberA {
                       ^
/build/deps/install/stow/libasn1c/include/asn1c/asn_SET_OF.h:17:16: note: in definition of macro 'A_SET_OF'
   void (*free)(type *);   \
                ^
../../include/osmocom/ranap/RANAP_LA-LIST.h:27:2: note: in expansion of macro 'A_SEQUENCE_OF'
  A_SEQUENCE_OF(struct MemberA {
  ^
  CC       RANAP_LHN-ID.lo
  CC       RANAP_Links-to-log.lo
  CC       RANAP_ListOF-SNAs.lo
  CC       RANAP_ListOfInterfacesToTrace.lo
  CC       RANAP_InterfacesToTraceItem.lo
  CC       RANAP_LoadValue.lo
  CC       RANAP_LocationRelatedDataRequestType.lo
  CC       RANAP_LocationRelatedDataRequestTypeSpecificToGERANIuMode.lo
  CC       RANAP_LocationReportingTransferInformation.lo
  CC       RANAP_ReportChangeOfSAI.lo
  CC       RANAP_PeriodicReportingIndicator.lo
  CC       RANAP_DirectReportingIndicator.lo
/bin/bash: line 1: 15427 Illegal instruction     (core dumped) /bin/bash ../../libtool --silent --tag=CC --mode=compile gcc -DPACKAGE_NAME=\"osmo-iuh\" -DPACKAGE_TARNAME=\"osmo-iuh\" -DPACKAGE_VERSION=\"0.4.0.6-f601\" -DPACKAGE_STRING=\"osmo-iuh\ 0.4.0.6-f601\" -DPACKAGE_BUGREPORT=\"openbsc at lists.osmocom.org\" -DPACKAGE_URL=\"\" -DSTDC_HEADERS=1 -DHAVE_SYS_TYPES_H=1 -DHAVE_SYS_STAT_H=1 -DHAVE_STDLIB_H=1 -DHAVE_STRING_H=1 -DHAVE_MEMORY_H=1 -DHAVE_STRINGS_H=1 -DHAVE_INTTYPES_H=1 -DHAVE_STDINT_H=1 -DHAVE_UNISTD_H=1 -DHAVE_DLFCN_H=1 -DLT_OBJDIR=\".libs/\" -DPACKAGE=\"osmo-iuh\" -DVERSION=\"0.4.0.6-f601\" -DSTDC_HEADERS=1 -I. -Wall -I../../include -I/build/deps/install/stow/libasn1c/include/ -I/build/deps/install/stow/libasn1c/include/asn1c -I/build/deps/install/stow/libosmocore/include/ -g -O2 -Wall -MT RANAP_DirectReportingIndicator.lo -MD -MP -MF .deps/RANAP_DirectReportingIndicator.Tpo -c -o RANAP_DirectReportingIndicator.lo RANAP_DirectReportingIndicator.c
Makefile:2495: recipe for target 'RANAP_DirectReportingIndicator.lo' failed
make[4]: *** [RANAP_DirectReportingIndicator.lo] Error 132
make[4]: *** Waiting for unfinished jobs....
  CC       RANAP_L3-Information.lo
make[4]: Leaving directory '/build/deps/osmo-iuh/src/ranap'
Makefile:631: recipe for target 'install-recursive' failed
make[3]: *** [install-recursive] Error 1
make[3]: Leaving directory '/build/deps/osmo-iuh/src'
Makefile:790: recipe for target 'install' failed
make[2]: *** [install] Error 2
make[2]: Leaving directory '/build/deps/osmo-iuh/src'
Makefile:446: recipe for target 'install-recursive' failed
make[1]: Leaving directory '/build/deps/osmo-iuh'
make[1]: *** [install-recursive] Error 1
make: *** [install] Error 2
Makefile:745: recipe for target 'install' failed
Build step 'Execute shell' marked build as failure
[WARNINGS]Skipping publisher since build result is FAILURE



More information about the jenkins-notifications mailing list