Compilation of TTCN3 tests for SGSN failed

Mirko Kovacevic northmirko at gmail.com
Thu May 21 13:47:00 UTC 2020


Git checkout to some random commit from April, have solved problem for me.
But in current master branch definitely the is a problem.

Regards.

On Thu, May 21, 2020 at 3:31 PM Mirko Kovacevic <northmirko at gmail.com>
wrote:

> *Hi, Osmocom-SGSN*
>
> I have downloaded latest master branch sources for TTCN3 tests.
>
>
> I followed instructions for  compilations and dependencies.
> In file :
> *regen_makefile.sh *
> If line with
> ../regen-makefile.sh  SGSN_Tests.ttcn $FILES
> is replaced with
> ../regen-makefile.sh  $FILES
> then this warning is not present
> File `SGSN_Tests.ttcn' was given more than once for the Makefile.
>
> Also,
> after command
>
> *make compile *
>
> *(same with *
>
> *make sgsn *
>
> *from upper dir.)*
> I got from output:
>
> ....
>  GSM_RR_Types.ttcn:404.2-408.2: In type definition `SecondPartAssign':
>   GSM_RR_Types.ttcn:409.18-20: error: in variant attribute, at or before
> token `CSN': syntax error, unexpected XIdentifier, expecting $end
>  GSM_RR_Types.ttcn:510.2-512.2: In type definition `IaRestOctLL':
>   GSM_RR_Types.ttcn:513.42-44: error: in variant attribute, at or before
> token `CSN': syntax error, unexpected XIdentifier, expecting $end
>  GSM_RR_Types.ttcn:588.2-594.2: In type definition `IaRestOctets':
>   GSM_RR_Types.ttcn:595.23-25: error: in variant attribute, at or before
> token `CSN': syntax error, unexpected XIdentifier, expecting $end
> ........
> Notify: Errors found in the input modules. Code will not be generated.
> make: *** [Makefile:206: compile] Error 1
>
> Last time in April, I played with TTCN3 for SGSN, everything was good.
>
> Can you help me with this ?
>
>
>
>
>
>

-- 

*Puno pozdrava,Mirko Kovacevic*
-------------- next part --------------
An HTML attachment was scrubbed...
URL: <http://lists.osmocom.org/pipermail/osmocom-net-gprs/attachments/20200521/d582f29a/attachment.htm>


More information about the osmocom-net-gprs mailing list