Fehler beim Kernel bauen

Jens Zerban JZerbe30 at web.de
Sat Jan 15 13:21:09 UTC 2011


unter Kanotix 2.6.30-10-generic habe ich nun folgenden Fehler bei make:

CC [M]  net/dect/mac_ccf.o
net/dect/mac_ccf.c:65: warning: ‘dect_slotnum’ defined but not used
net/dect/mac_ccf.c:75: warning: ‘dect_mfn’ defined but not used
net/dect/mac_ccf.c:211: warning: ‘dect_mbc_tb_get_by_lbn’ defined but not used
 CC [M]  net/dect/dsc.o
 CC [M]  net/dect/dlc.o
 CC [M]  net/dect/dlc_cplane.o
 CC [M]  net/dect/dlc_b_sap.o
 CC [M]  net/dect/dlc_s_sap.o
 CC [M]  net/dect/dlc_uplane.o
 CC [M]  net/dect/ccp.o
net/dect/ccp.c: In function ‘dect_ccp_send_to_cell’:
net/dect/ccp.c:55: error: implicit declaration of function ‘tipc_send_buf’
make[2]: *** [net/dect/ccp.o] Fehler 1
make[1]: *** [net/dect] Fehler 2
make: *** [net] Fehler 2

Kann jemand helfen?
___________________________________________________________
NEU: FreePhone - kostenlos mobil telefonieren und surfen!				
Jetzt informieren: http://produkte.web.de/go/webdefreephone




More information about the linux-dect mailing list