Build failed in Jenkins: master-osmo-sgsn » --enable-iu,0,a3=default,a4=default,osmocom-master-debian9 #27033

jenkins at lists.osmocom.org jenkins at lists.osmocom.org
Wed Jun 30 07:39:32 UTC 2021


See <https://jenkins.osmocom.org/jenkins/job/master-osmo-sgsn/IU=--enable-iu,WITH_MANUALS=0,a3=default,a4=default,label=osmocom-master-debian9/27033/display/redirect>

Changes:


------------------------------------------
[...truncated 571.47 KB...]
../include/osmocom/ranap/ranap_ies_defs.h:748:0: note: this is the location of the previous definition
 #define RANAP_ENHANCEDRELOCATIONINFORMATIONREQUESTIES_RANAP_IUSIGNALLINGCONNECTIONIDENTIFIER_PRESENT     (1 << 0)
 
../include/osmocom/ranap/ranap_ies_defs.h:751:0: warning: "RANAP_ENHANCEDRELOCATIONINFORMATIONREQUESTIES_RANAP_GLOBALCN_ID_PRESENT" redefined
 #define RANAP_ENHANCEDRELOCATIONINFORMATIONREQUESTIES_RANAP_GLOBALCN_ID_PRESENT                          (1 << 3)
 
../include/osmocom/ranap/ranap_ies_defs.h:749:0: note: this is the location of the previous definition
 #define RANAP_ENHANCEDRELOCATIONINFORMATIONREQUESTIES_RANAP_GLOBALCN_ID_PRESENT                          (1 << 1)
 
../include/osmocom/ranap/ranap_ies_defs.h:773:0: warning: "ENHANCEDRELOCATIONCOMPLETEREQUESTIES_RANAP_EXTENDEDRNC_ID_PRESENT" redefined
 #define ENHANCEDRELOCATIONCOMPLETEREQUESTIES_RANAP_EXTENDEDRNC_ID_PRESENT                   (1 << 1)
 
../include/osmocom/ranap/ranap_ies_defs.h:772:0: note: this is the location of the previous definition
 #define ENHANCEDRELOCATIONCOMPLETEREQUESTIES_RANAP_EXTENDEDRNC_ID_PRESENT                   (1 << 0)
 
  CC       hnbgw_vty.o
  CC       context_map.o
  CC       hnbgw_cn.o
In file included from /build/deps/install/stow/libasn1c/include/asn1c/asn_SEQUENCE_OF.h:8:0,
                 from ../include/osmocom/ranap/RANAP_IE-Extensions.h:15,
                 from ../include/osmocom/ranap/RANAP_AllocationOrRetentionPriority.h:18,
                 from ../include/osmocom/ranap/ranap_common.h:8,
                 from ../include/osmocom/ranap/ranap_ies_defs.h:7,
                 from hnbgw_cn.c:34:
../include/osmocom/ranap/RANAP_GA-Polygon.h:26:23: warning: ‘struct Member’ declared inside parameter list will not be visible outside of this definition or declaration
  A_SEQUENCE_OF(struct Member {
                       ^
/build/deps/install/stow/libasn1c/include/asn1c/asn_SET_OF.h:17:16: note: in definition of macro ‘A_SET_OF’
   void (*free)(type *);   \
                ^~~~
../include/osmocom/ranap/RANAP_GA-Polygon.h:26:2: note: in expansion of macro ‘A_SEQUENCE_OF’
  A_SEQUENCE_OF(struct Member {
  ^~~~~~~~~~~~~
../include/osmocom/ranap/RANAP_AuthorisedPLMNs.h:27:23: warning: ‘struct MemberC’ declared inside parameter list will not be visible outside of this definition or declaration
  A_SEQUENCE_OF(struct MemberC {
                       ^
/build/deps/install/stow/libasn1c/include/asn1c/asn_SET_OF.h:17:16: note: in definition of macro ‘A_SET_OF’
   void (*free)(type *);   \
                ^~~~
../include/osmocom/ranap/RANAP_AuthorisedPLMNs.h:27:2: note: in expansion of macro ‘A_SEQUENCE_OF’
  A_SEQUENCE_OF(struct MemberC {
  ^~~~~~~~~~~~~
../include/osmocom/ranap/RANAP_JoinedMBMSBearerService-IEs.h:27:23: warning: ‘struct MemberF’ declared inside parameter list will not be visible outside of this definition or declaration
  A_SEQUENCE_OF(struct MemberF {
                       ^
/build/deps/install/stow/libasn1c/include/asn1c/asn_SET_OF.h:17:16: note: in definition of macro ‘A_SET_OF’
   void (*free)(type *);   \
                ^~~~
../include/osmocom/ranap/RANAP_JoinedMBMSBearerService-IEs.h:27:2: note: in expansion of macro ‘A_SEQUENCE_OF’
  A_SEQUENCE_OF(struct MemberF {
  ^~~~~~~~~~~~~
../include/osmocom/ranap/RANAP_CriticalityDiagnostics-IE-List.h:28:23: warning: ‘struct MemberG’ declared inside parameter list will not be visible outside of this definition or declaration
  A_SEQUENCE_OF(struct MemberG {
                       ^
/build/deps/install/stow/libasn1c/include/asn1c/asn_SET_OF.h:17:16: note: in definition of macro ‘A_SET_OF’
   void (*free)(type *);   \
                ^~~~
../include/osmocom/ranap/RANAP_CriticalityDiagnostics-IE-List.h:28:2: note: in expansion of macro ‘A_SEQUENCE_OF’
  A_SEQUENCE_OF(struct MemberG {
  ^~~~~~~~~~~~~
../include/osmocom/ranap/RANAP_DataVolumeList.h:27:23: warning: ‘struct MemberH’ declared inside parameter list will not be visible outside of this definition or declaration
  A_SEQUENCE_OF(struct MemberH {
                       ^
/build/deps/install/stow/libasn1c/include/asn1c/asn_SET_OF.h:17:16: note: in definition of macro ‘A_SET_OF’
   void (*free)(type *);   \
                ^~~~
../include/osmocom/ranap/RANAP_DataVolumeList.h:27:2: note: in expansion of macro ‘A_SEQUENCE_OF’
  A_SEQUENCE_OF(struct MemberH {
  ^~~~~~~~~~~~~
../include/osmocom/ranap/RANAP_EUTRANFrequencies.h:27:23: warning: ‘struct MemberJ’ declared inside parameter list will not be visible outside of this definition or declaration
  A_SEQUENCE_OF(struct MemberJ {
                       ^
/build/deps/install/stow/libasn1c/include/asn1c/asn_SET_OF.h:17:16: note: in definition of macro ‘A_SET_OF’
   void (*free)(type *);   \
                ^~~~
../include/osmocom/ranap/RANAP_EUTRANFrequencies.h:27:2: note: in expansion of macro ‘A_SEQUENCE_OF’
  A_SEQUENCE_OF(struct MemberJ {
  ^~~~~~~~~~~~~
  CCLD     libosmo-sabp.la
In file included from /build/deps/install/stow/libasn1c/include/asn1c/asn_SEQUENCE_OF.h:8:0,
                 from ../include/osmocom/ranap/RANAP_IE-Extensions.h:15,
                 from ../include/osmocom/ranap/RANAP_AllocationOrRetentionPriority.h:18,
                 from ../include/osmocom/ranap/ranap_common.h:8,
                 from ../include/osmocom/ranap/ranap_ies_defs.h:7,
                 from hnbgw_cn.c:34:
../include/osmocom/ranap/RANAP_LA-LIST.h:27:23: warning: ‘struct MemberA’ declared inside parameter list will not be visible outside of this definition or declaration
  A_SEQUENCE_OF(struct MemberA {
                       ^
/build/deps/install/stow/libasn1c/include/asn1c/asn_SET_OF.h:17:16: note: in definition of macro ‘A_SET_OF’
   void (*free)(type *);   \
                ^~~~
../include/osmocom/ranap/RANAP_LA-LIST.h:27:2: note: in expansion of macro ‘A_SEQUENCE_OF’
  A_SEQUENCE_OF(struct MemberA {
  ^~~~~~~~~~~~~
../include/osmocom/ranap/RANAP_LeftMBMSBearerService-IEs.h:26:23: warning: ‘struct MemberK’ declared inside parameter list will not be visible outside of this definition or declaration
  A_SEQUENCE_OF(struct MemberK {
                       ^
/build/deps/install/stow/libasn1c/include/asn1c/asn_SET_OF.h:17:16: note: in definition of macro ‘A_SET_OF’
   void (*free)(type *);   \
                ^~~~
../include/osmocom/ranap/RANAP_LeftMBMSBearerService-IEs.h:26:2: note: in expansion of macro ‘A_SEQUENCE_OF’
  A_SEQUENCE_OF(struct MemberK {
  ^~~~~~~~~~~~~
../include/osmocom/ranap/RANAP_MessageStructure.h:27:23: warning: ‘struct MemberL’ declared inside parameter list will not be visible outside of this definition or declaration
  A_SEQUENCE_OF(struct MemberL {
                       ^
/build/deps/install/stow/libasn1c/include/asn1c/asn_SET_OF.h:17:16: note: in definition of macro ‘A_SET_OF’
   void (*free)(type *);   \
                ^~~~
../include/osmocom/ranap/RANAP_MessageStructure.h:27:2: note: in expansion of macro ‘A_SEQUENCE_OF’
  A_SEQUENCE_OF(struct MemberL {
  ^~~~~~~~~~~~~
../include/osmocom/ranap/RANAP_PLMNs-in-shared-network.h:27:23: warning: ‘struct MemberM’ declared inside parameter list will not be visible outside of this definition or declaration
  A_SEQUENCE_OF(struct MemberM {
                       ^
/build/deps/install/stow/libasn1c/include/asn1c/asn_SET_OF.h:17:16: note: in definition of macro ‘A_SET_OF’
   void (*free)(type *);   \
                ^~~~
../include/osmocom/ranap/RANAP_PLMNs-in-shared-network.h:27:2: note: in expansion of macro ‘A_SEQUENCE_OF’
  A_SEQUENCE_OF(struct MemberM {
  ^~~~~~~~~~~~~
../include/osmocom/ranap/RANAP_RABDataVolumeReport.h:27:23: warning: ‘struct MemberN’ declared inside parameter list will not be visible outside of this definition or declaration
  A_SEQUENCE_OF(struct MemberN {
                       ^
/build/deps/install/stow/libasn1c/include/asn1c/asn_SET_OF.h:17:16: note: in definition of macro ‘A_SET_OF’
   void (*free)(type *);   \
                ^~~~
../include/osmocom/ranap/RANAP_RABDataVolumeReport.h:27:2: note: in expansion of macro ‘A_SEQUENCE_OF’
  A_SEQUENCE_OF(struct MemberN {
  ^~~~~~~~~~~~~
../include/osmocom/ranap/RANAP_RABParametersList.h:29:23: warning: ‘struct MemberB’ declared inside parameter list will not be visible outside of this definition or declaration
  A_SEQUENCE_OF(struct MemberB {
                       ^
/build/deps/install/stow/libasn1c/include/asn1c/asn_SET_OF.h:17:16: note: in definition of macro ‘A_SET_OF’
   void (*free)(type *);   \
                ^~~~
../include/osmocom/ranap/RANAP_RABParametersList.h:29:2: note: in expansion of macro ‘A_SEQUENCE_OF’
  A_SEQUENCE_OF(struct MemberB {
  ^~~~~~~~~~~~~
../include/osmocom/ranap/RANAP_UnsuccessfulLinking-IEs.h:27:23: warning: ‘struct MemberD’ declared inside parameter list will not be visible outside of this definition or declaration
  A_SEQUENCE_OF(struct MemberD {
                       ^
/build/deps/install/stow/libasn1c/include/asn1c/asn_SET_OF.h:17:16: note: in definition of macro ‘A_SET_OF’
   void (*free)(type *);   \
                ^~~~
../include/osmocom/ranap/RANAP_UnsuccessfulLinking-IEs.h:27:2: note: in expansion of macro ‘A_SEQUENCE_OF’
  A_SEQUENCE_OF(struct MemberD {
  ^~~~~~~~~~~~~
In file included from ../include/osmocom/ranap/ranap_common.h:592:0,
                 from ../include/osmocom/ranap/ranap_ies_defs.h:7,
                 from hnbgw_cn.c:34:
../include/osmocom/ranap/ranap_ies_defs.h:750:0: warning: "RANAP_ENHANCEDRELOCATIONINFORMATIONREQUESTIES_RANAP_IUSIGNALLINGCONNECTIONIDENTIFIER_PRESENT" redefined
 #define RANAP_ENHANCEDRELOCATIONINFORMATIONREQUESTIES_RANAP_IUSIGNALLINGCONNECTIONIDENTIFIER_PRESENT     (1 << 2)
 
../include/osmocom/ranap/ranap_ies_defs.h:748:0: note: this is the location of the previous definition
 #define RANAP_ENHANCEDRELOCATIONINFORMATIONREQUESTIES_RANAP_IUSIGNALLINGCONNECTIONIDENTIFIER_PRESENT     (1 << 0)
 
../include/osmocom/ranap/ranap_ies_defs.h:751:0: warning: "RANAP_ENHANCEDRELOCATIONINFORMATIONREQUESTIES_RANAP_GLOBALCN_ID_PRESENT" redefined
 #define RANAP_ENHANCEDRELOCATIONINFORMATIONREQUESTIES_RANAP_GLOBALCN_ID_PRESENT                          (1 << 3)
 
../include/osmocom/ranap/ranap_ies_defs.h:749:0: note: this is the location of the previous definition
 #define RANAP_ENHANCEDRELOCATIONINFORMATIONREQUESTIES_RANAP_GLOBALCN_ID_PRESENT                          (1 << 1)
 
../include/osmocom/ranap/ranap_ies_defs.h:773:0: warning: "ENHANCEDRELOCATIONCOMPLETEREQUESTIES_RANAP_EXTENDEDRNC_ID_PRESENT" redefined
 #define ENHANCEDRELOCATIONCOMPLETEREQUESTIES_RANAP_EXTENDEDRNC_ID_PRESENT                   (1 << 1)
 
../include/osmocom/ranap/ranap_ies_defs.h:772:0: note: this is the location of the previous definition
 #define ENHANCEDRELOCATIONCOMPLETEREQUESTIES_RANAP_EXTENDEDRNC_ID_PRESENT                   (1 << 0)
 
ar: `u' modifier ignored since `D' is the default (see `U')
  CCLD     libosmo-ranap.la
ar: `u' modifier ignored since `D' is the default (see `U')
ranlib: .libs/libosmo-ranap.a: No space left on device
Makefile:547: recipe for target 'libosmo-ranap.la' failed
make[4]: Leaving directory '/build/deps/osmo-iuh/src'
make[4]: *** [libosmo-ranap.la] Error 1
Makefile:671: recipe for target 'install-recursive' failed
make[3]: Leaving directory '/build/deps/osmo-iuh/src'
make[3]: *** [install-recursive] Error 1
Makefile:830: recipe for target 'install' failed
make[2]: *** [install] Error 2
make[2]: Leaving directory '/build/deps/osmo-iuh/src'
make[1]: *** [install-recursive] Error 1
Makefile:468: recipe for target 'install-recursive' failed
make[1]: Leaving directory '/build/deps/osmo-iuh'
Makefile:767: recipe for target 'install' failed
make: *** [install] Error 2
FATAL: command execution failed
java.io.EOFException
	at java.io.ObjectInputStream$PeekInputStream.readFully(ObjectInputStream.java:2799)
	at java.io.ObjectInputStream$BlockDataInputStream.readShort(ObjectInputStream.java:3274)
	at java.io.ObjectInputStream.readStreamHeader(ObjectInputStream.java:934)
	at java.io.ObjectInputStream.<init>(ObjectInputStream.java:396)
	at hudson.remoting.ObjectInputStreamEx.<init>(ObjectInputStreamEx.java:49)
	at hudson.remoting.Command.readFrom(Command.java:142)
	at hudson.remoting.Command.readFrom(Command.java:128)
	at hudson.remoting.AbstractSynchronousByteArrayCommandTransport.read(AbstractSynchronousByteArrayCommandTransport.java:35)
	at hudson.remoting.SynchronousCommandTransport$ReaderThread.run(SynchronousCommandTransport.java:61)
Caused: java.io.IOException: Unexpected termination of the channel
	at hudson.remoting.SynchronousCommandTransport$ReaderThread.run(SynchronousCommandTransport.java:75)
Caused: java.io.IOException: Backing channel 'gtp0-deb9build' is disconnected.
	at hudson.remoting.RemoteInvocationHandler.channelOrFail(RemoteInvocationHandler.java:216)
	at hudson.remoting.RemoteInvocationHandler.invoke(RemoteInvocationHandler.java:286)
	at com.sun.proxy.$Proxy64.isAlive(Unknown Source)
	at hudson.Launcher$RemoteLauncher$ProcImpl.isAlive(Launcher.java:1211)
	at hudson.Launcher$RemoteLauncher$ProcImpl.join(Launcher.java:1203)
	at hudson.tasks.CommandInterpreter.join(CommandInterpreter.java:194)
	at hudson.tasks.CommandInterpreter.perform(CommandInterpreter.java:144)
	at hudson.tasks.CommandInterpreter.perform(CommandInterpreter.java:91)
	at hudson.tasks.BuildStepMonitor$1.perform(BuildStepMonitor.java:20)
	at hudson.model.AbstractBuild$AbstractBuildExecution.perform(AbstractBuild.java:803)
	at hudson.model.Build$BuildExecution.build(Build.java:197)
	at hudson.model.Build$BuildExecution.doRun(Build.java:163)
	at hudson.model.AbstractBuild$AbstractBuildExecution.run(AbstractBuild.java:513)
	at hudson.model.Run.execute(Run.java:1907)
	at hudson.matrix.MatrixRun.run(MatrixRun.java:153)
	at hudson.model.ResourceController.execute(ResourceController.java:97)
	at hudson.model.Executor.run(Executor.java:429)
FATAL: Unable to delete script file /tmp/jenkins6987271041296006554.sh
java.io.EOFException
	at java.io.ObjectInputStream$PeekInputStream.readFully(ObjectInputStream.java:2799)
	at java.io.ObjectInputStream$BlockDataInputStream.readShort(ObjectInputStream.java:3274)
	at java.io.ObjectInputStream.readStreamHeader(ObjectInputStream.java:934)
	at java.io.ObjectInputStream.<init>(ObjectInputStream.java:396)
	at hudson.remoting.ObjectInputStreamEx.<init>(ObjectInputStreamEx.java:49)
	at hudson.remoting.Command.readFrom(Command.java:142)
	at hudson.remoting.Command.readFrom(Command.java:128)
	at hudson.remoting.AbstractSynchronousByteArrayCommandTransport.read(AbstractSynchronousByteArrayCommandTransport.java:35)
	at hudson.remoting.SynchronousCommandTransport$ReaderThread.run(SynchronousCommandTransport.java:61)
Caused: java.io.IOException: Unexpected termination of the channel
	at hudson.remoting.SynchronousCommandTransport$ReaderThread.run(SynchronousCommandTransport.java:75)
Caused: hudson.remoting.ChannelClosedException: Channel "hudson.remoting.Channel at 3e1f1a7e:gtp0-deb9build": Remote call on gtp0-deb9build failed. The channel is closing down or has closed down
	at hudson.remoting.Channel.call(Channel.java:994)
	at hudson.FilePath.act(FilePath.java:1158)
	at hudson.FilePath.act(FilePath.java:1147)
	at hudson.FilePath.delete(FilePath.java:1670)
	at hudson.tasks.CommandInterpreter.perform(CommandInterpreter.java:162)
	at hudson.tasks.CommandInterpreter.perform(CommandInterpreter.java:91)
	at hudson.tasks.BuildStepMonitor$1.perform(BuildStepMonitor.java:20)
	at hudson.model.AbstractBuild$AbstractBuildExecution.perform(AbstractBuild.java:803)
	at hudson.model.Build$BuildExecution.build(Build.java:197)
	at hudson.model.Build$BuildExecution.doRun(Build.java:163)
	at hudson.model.AbstractBuild$AbstractBuildExecution.run(AbstractBuild.java:513)
	at hudson.model.Run.execute(Run.java:1907)
	at hudson.matrix.MatrixRun.run(MatrixRun.java:153)
	at hudson.model.ResourceController.execute(ResourceController.java:97)
	at hudson.model.Executor.run(Executor.java:429)
Build step 'Execute shell' marked build as failure
ERROR: Step ‘[Deprecated] Scan for compiler warnings’ failed: no workspace for master-osmo-sgsn/IU=--enable-iu,WITH_MANUALS=0,a3=default,a4=default,label=osmocom-master-debian9 #27033


More information about the jenkins-notifications mailing list