Build failed in Jenkins: master-osmo-sgsn » --enable-iu,0,a3=default,a4=default,osmocom-master-debian9 #27034

jenkins at lists.osmocom.org jenkins at lists.osmocom.org
Wed Jun 30 07:39:32 UTC 2021


See <https://jenkins.osmocom.org/jenkins/job/master-osmo-sgsn/IU=--enable-iu,WITH_MANUALS=0,a3=default,a4=default,label=osmocom-master-debian9/27034/display/redirect>

Changes:


------------------------------------------
[...truncated 338.12 KB...]
make[3]: Entering directory '/build/deps/osmo-hlr/doc/examples'
make[4]: Entering directory '/build/deps/osmo-hlr/doc/examples'
make[4]: Nothing to be done for 'install-exec-am'.
 /bin/mkdir -p '/build/deps/install/stow/osmo-hlr/etc/osmocom'
 /usr/bin/install -c -m 644 osmo-hlr.cfg '/build/deps/install/stow/osmo-hlr/etc/osmocom'
make  install-data-hook
make[5]: Entering directory '/build/deps/osmo-hlr/doc/examples'
for f in $(find . -name '*.cfg*' | sed -e 's,^.,,'); do \
	j="/build/deps/install/stow/osmo-hlr/share/doc/osmo-hlr/examples/$f" && \
	mkdir -p "$(dirname $j)" && \
	/usr/bin/install -c -m 644 ./$f $j; \
done
make[5]: Leaving directory '/build/deps/osmo-hlr/doc/examples'
make[4]: Leaving directory '/build/deps/osmo-hlr/doc/examples'
make[3]: Leaving directory '/build/deps/osmo-hlr/doc/examples'
Making install in manuals
make[3]: Entering directory '/build/deps/osmo-hlr/doc/manuals'
make[4]: Entering directory '/build/deps/osmo-hlr/doc/manuals'
make[4]: Nothing to be done for 'install-exec-am'.
make[4]: Nothing to be done for 'install-data-am'.
make[4]: Leaving directory '/build/deps/osmo-hlr/doc/manuals'
make[3]: Leaving directory '/build/deps/osmo-hlr/doc/manuals'
make[3]: Entering directory '/build/deps/osmo-hlr/doc'
make[4]: Entering directory '/build/deps/osmo-hlr/doc'
make[4]: Nothing to be done for 'install-exec-am'.
make[4]: Nothing to be done for 'install-data-am'.
make[4]: Leaving directory '/build/deps/osmo-hlr/doc'
make[3]: Leaving directory '/build/deps/osmo-hlr/doc'
make[2]: Leaving directory '/build/deps/osmo-hlr/doc'
Making install in sql
make[2]: Entering directory '/build/deps/osmo-hlr/sql'
make[3]: Entering directory '/build/deps/osmo-hlr/sql'
make[3]: Nothing to be done for 'install-exec-am'.
/bin/mkdir -p /build/deps/install/stow/osmo-hlr/var/lib/osmocom
 /bin/mkdir -p '/build/deps/install/stow/osmo-hlr/share/doc/osmo-hlr/sql'
 /usr/bin/install -c -m 644 ./hlr.sql ./hlr_data.sql '/build/deps/install/stow/osmo-hlr/share/doc/osmo-hlr/sql'
make[3]: Leaving directory '/build/deps/osmo-hlr/sql'
make[2]: Leaving directory '/build/deps/osmo-hlr/sql'
Making install in contrib
make[2]: Entering directory '/build/deps/osmo-hlr/contrib'
Making install in systemd
make[3]: Entering directory '/build/deps/osmo-hlr/contrib/systemd'
make[4]: Entering directory '/build/deps/osmo-hlr/contrib/systemd'
make[4]: Nothing to be done for 'install-exec-am'.
 /bin/mkdir -p '/build/deps/install/stow/osmo-hlr/lib/systemd/system'
 /usr/bin/install -c -m 644 osmo-hlr.service '/build/deps/install/stow/osmo-hlr/lib/systemd/system'
make[4]: Leaving directory '/build/deps/osmo-hlr/contrib/systemd'
make[3]: Leaving directory '/build/deps/osmo-hlr/contrib/systemd'
Making install in dgsm
make[3]: Entering directory '/build/deps/osmo-hlr/contrib/dgsm'
make[4]: Entering directory '/build/deps/osmo-hlr/contrib/dgsm'
make[4]: Nothing to be done for 'install-exec-am'.
make[4]: Nothing to be done for 'install-data-am'.
make[4]: Leaving directory '/build/deps/osmo-hlr/contrib/dgsm'
make[3]: Leaving directory '/build/deps/osmo-hlr/contrib/dgsm'
make[3]: Entering directory '/build/deps/osmo-hlr/contrib'
make[4]: Entering directory '/build/deps/osmo-hlr/contrib'
make[4]: Nothing to be done for 'install-exec-am'.
make  install-data-hook
make[5]: Entering directory '/build/deps/osmo-hlr/contrib'
install -Dm755 ./osmo-hlr-post-upgrade.sh \
	-t /build/deps/install/stow/osmo-hlr/share/osmocom/
make[5]: Leaving directory '/build/deps/osmo-hlr/contrib'
make[4]: Leaving directory '/build/deps/osmo-hlr/contrib'
make[3]: Leaving directory '/build/deps/osmo-hlr/contrib'
make[2]: Leaving directory '/build/deps/osmo-hlr/contrib'
Making install in tests
make[2]: Entering directory '/build/deps/osmo-hlr/tests'
Making install in auc
make[3]: Entering directory '/build/deps/osmo-hlr/tests/auc'
Making install in gen_ts_55_205_test_sets
make[4]: Entering directory '/build/deps/osmo-hlr/tests/auc/gen_ts_55_205_test_sets'
make[5]: Entering directory '/build/deps/osmo-hlr/tests/auc/gen_ts_55_205_test_sets'
make[5]: Nothing to be done for 'install-exec-am'.
make[5]: Nothing to be done for 'install-data-am'.
make[5]: Leaving directory '/build/deps/osmo-hlr/tests/auc/gen_ts_55_205_test_sets'
make[4]: Leaving directory '/build/deps/osmo-hlr/tests/auc/gen_ts_55_205_test_sets'
make[4]: Entering directory '/build/deps/osmo-hlr/tests/auc'
  CC       auc_test.o
  CCLD     auc_test
make[5]: Entering directory '/build/deps/osmo-hlr/tests/auc'
make[5]: Nothing to be done for 'install-exec-am'.
make[5]: Nothing to be done for 'install-data-am'.
make[5]: Leaving directory '/build/deps/osmo-hlr/tests/auc'
make[4]: Leaving directory '/build/deps/osmo-hlr/tests/auc'
make[3]: Leaving directory '/build/deps/osmo-hlr/tests/auc'
Making install in gsup_server
make[3]: Entering directory '/build/deps/osmo-hlr/tests/gsup_server'
  CC       gsup_server_test.o
  CCLD     gsup_server_test
../../src/gsup_server.c: In function 'osmo_gsup_create_insert_subscriber_data_msg':
../../src/gsup_server.c:520:10: note: #pragma message: FIXME: deal with encoding the following data: gsup.hlr_enc
  #pragma message "FIXME: deal with encoding the following data: gsup.hlr_enc"
          ^~~~~~~
make[4]: Entering directory '/build/deps/osmo-hlr/tests/gsup_server'
make[4]: Nothing to be done for 'install-exec-am'.
make[4]: Nothing to be done for 'install-data-am'.
make[4]: Leaving directory '/build/deps/osmo-hlr/tests/gsup_server'
make[3]: Leaving directory '/build/deps/osmo-hlr/tests/gsup_server'
Making install in db
make[3]: Entering directory '/build/deps/osmo-hlr/tests/db'
make[4]: Entering directory '/build/deps/osmo-hlr/tests/db'
make[4]: Nothing to be done for 'install-exec-am'.
make[4]: Nothing to be done for 'install-data-am'.
make[4]: Leaving directory '/build/deps/osmo-hlr/tests/db'
make[3]: Leaving directory '/build/deps/osmo-hlr/tests/db'
Making install in gsup
make[3]: Entering directory '/build/deps/osmo-hlr/tests/gsup'
  CC       gsup_test.o
  CCLD     gsup_test
make[4]: Entering directory '/build/deps/osmo-hlr/tests/gsup'
make[4]: Nothing to be done for 'install-exec-am'.
make[4]: Nothing to be done for 'install-data-am'.
make[4]: Leaving directory '/build/deps/osmo-hlr/tests/gsup'
make[3]: Leaving directory '/build/deps/osmo-hlr/tests/gsup'
Making install in db_upgrade
make[3]: Entering directory '/build/deps/osmo-hlr/tests/db_upgrade'
make[4]: Entering directory '/build/deps/osmo-hlr/tests/db_upgrade'
make[4]: Nothing to be done for 'install-exec-am'.
make[4]: Nothing to be done for 'install-data-am'.
make[4]: Leaving directory '/build/deps/osmo-hlr/tests/db_upgrade'
make[3]: Leaving directory '/build/deps/osmo-hlr/tests/db_upgrade'
Making install in mslookup
make[3]: Entering directory '/build/deps/osmo-hlr/tests/mslookup'
make[4]: Entering directory '/build/deps/osmo-hlr/tests/mslookup'
make[4]: Nothing to be done for 'install-exec-am'.
make[4]: Nothing to be done for 'install-data-am'.
make[4]: Leaving directory '/build/deps/osmo-hlr/tests/mslookup'
make[3]: Leaving directory '/build/deps/osmo-hlr/tests/mslookup'
make[3]: Entering directory '/build/deps/osmo-hlr/tests'
make[4]: Entering directory '/build/deps/osmo-hlr/tests'
make[4]: Nothing to be done for 'install-exec-am'.
make[4]: Nothing to be done for 'install-data-am'.
make[4]: Leaving directory '/build/deps/osmo-hlr/tests'
make[3]: Leaving directory '/build/deps/osmo-hlr/tests'
make[2]: Leaving directory '/build/deps/osmo-hlr/tests'
make[2]: Entering directory '/build/deps/osmo-hlr'
make[3]: Entering directory '/build/deps/osmo-hlr'
make[3]: Nothing to be done for 'install-exec-am'.
 /bin/mkdir -p '/build/deps/install/stow/osmo-hlr/lib/pkgconfig'
 /usr/bin/install -c -m 644 libosmo-gsup-client.pc libosmo-mslookup.pc '/build/deps/install/stow/osmo-hlr/lib/pkgconfig'
make[3]: Leaving directory '/build/deps/osmo-hlr'
make[2]: Leaving directory '/build/deps/osmo-hlr'
make[1]: Leaving directory '/build/deps/osmo-hlr'
+ STOW_DIR=/build/deps/install/stow stow --restow osmo-hlr
+ enable_werror=
+ '[' x--enable-iu = x--enable-iu ']'
+ osmo-build-dep.sh libosmo-sccp
+ mkdir -p /build/deps



 =============================== libosmo-sccp ===============================

+ cd /build/deps
+ osmo-deps.sh libosmo-sccp 
+ project=libosmo-sccp
+ branch=master
+ git branch -a
+ grep -c remotes/origin/master$
+ [ x1 != x0 ]
+ branch=origin/master
+ test -d libosmo-sccp
+ cd libosmo-sccp
+ git fetch --tags origin
+ git fetch origin
+ deps= osmo-clean-workspace.sh
+ chmod -R +w .
+ git checkout -f HEAD
+ git clean -dxf
+ [ -d  ]
+ [ -d layer1-headers ]
+ git checkout -f origin/master
HEAD is now at b4f1b2c... osmo_ss7_vty: automatically create routes for routing key
+ git rev-parse HEAD
b4f1b2cb8bd404f08601dc8ca700b672a455846c
+ cd libosmo-sccp
+ mkdir -p /build/deps/install/stow
+ osmo_source_subdir libosmo-sccp
+ subdir=
+ [ -n  ]
+ autoreconf --install --force
libtoolize: putting auxiliary files in AC_CONFIG_AUX_DIR, '.'.
libtoolize: copying file './ltmain.sh'
libtoolize: Consider adding 'AC_CONFIG_MACRO_DIRS([m4])' to configure.ac,
libtoolize: and rerunning libtoolize and aclocal.
libtoolize: Consider adding '-I m4' to ACLOCAL_AMFLAGS in Makefile.am.
FATAL: command execution failed
java.io.EOFException
	at java.io.ObjectInputStream$PeekInputStream.readFully(ObjectInputStream.java:2799)
	at java.io.ObjectInputStream$BlockDataInputStream.readShort(ObjectInputStream.java:3274)
	at java.io.ObjectInputStream.readStreamHeader(ObjectInputStream.java:934)
	at java.io.ObjectInputStream.<init>(ObjectInputStream.java:396)
	at hudson.remoting.ObjectInputStreamEx.<init>(ObjectInputStreamEx.java:49)
	at hudson.remoting.Command.readFrom(Command.java:142)
	at hudson.remoting.Command.readFrom(Command.java:128)
	at hudson.remoting.AbstractSynchronousByteArrayCommandTransport.read(AbstractSynchronousByteArrayCommandTransport.java:35)
	at hudson.remoting.SynchronousCommandTransport$ReaderThread.run(SynchronousCommandTransport.java:61)
Caused: java.io.IOException: Unexpected termination of the channel
	at hudson.remoting.SynchronousCommandTransport$ReaderThread.run(SynchronousCommandTransport.java:75)
Caused: java.io.IOException: Backing channel 'gtp0-deb9build' is disconnected.
	at hudson.remoting.RemoteInvocationHandler.channelOrFail(RemoteInvocationHandler.java:216)
	at hudson.remoting.RemoteInvocationHandler.invoke(RemoteInvocationHandler.java:286)
	at com.sun.proxy.$Proxy64.isAlive(Unknown Source)
	at hudson.Launcher$RemoteLauncher$ProcImpl.isAlive(Launcher.java:1211)
	at hudson.Launcher$RemoteLauncher$ProcImpl.join(Launcher.java:1203)
	at hudson.tasks.CommandInterpreter.join(CommandInterpreter.java:194)
	at hudson.tasks.CommandInterpreter.perform(CommandInterpreter.java:144)
	at hudson.tasks.CommandInterpreter.perform(CommandInterpreter.java:91)
	at hudson.tasks.BuildStepMonitor$1.perform(BuildStepMonitor.java:20)
	at hudson.model.AbstractBuild$AbstractBuildExecution.perform(AbstractBuild.java:803)
	at hudson.model.Build$BuildExecution.build(Build.java:197)
	at hudson.model.Build$BuildExecution.doRun(Build.java:163)
	at hudson.model.AbstractBuild$AbstractBuildExecution.run(AbstractBuild.java:513)
	at hudson.model.Run.execute(Run.java:1907)
	at hudson.matrix.MatrixRun.run(MatrixRun.java:153)
	at hudson.model.ResourceController.execute(ResourceController.java:97)
	at hudson.model.Executor.run(Executor.java:429)
FATAL: Unable to delete script file /tmp/jenkins452763657500853025.sh
java.io.EOFException
	at java.io.ObjectInputStream$PeekInputStream.readFully(ObjectInputStream.java:2799)
	at java.io.ObjectInputStream$BlockDataInputStream.readShort(ObjectInputStream.java:3274)
	at java.io.ObjectInputStream.readStreamHeader(ObjectInputStream.java:934)
	at java.io.ObjectInputStream.<init>(ObjectInputStream.java:396)
	at hudson.remoting.ObjectInputStreamEx.<init>(ObjectInputStreamEx.java:49)
	at hudson.remoting.Command.readFrom(Command.java:142)
	at hudson.remoting.Command.readFrom(Command.java:128)
	at hudson.remoting.AbstractSynchronousByteArrayCommandTransport.read(AbstractSynchronousByteArrayCommandTransport.java:35)
	at hudson.remoting.SynchronousCommandTransport$ReaderThread.run(SynchronousCommandTransport.java:61)
Caused: java.io.IOException: Unexpected termination of the channel
	at hudson.remoting.SynchronousCommandTransport$ReaderThread.run(SynchronousCommandTransport.java:75)
Caused: hudson.remoting.ChannelClosedException: Channel "hudson.remoting.Channel at 3e1f1a7e:gtp0-deb9build": Remote call on gtp0-deb9build failed. The channel is closing down or has closed down
	at hudson.remoting.Channel.call(Channel.java:994)
	at hudson.FilePath.act(FilePath.java:1158)
	at hudson.FilePath.act(FilePath.java:1147)
	at hudson.FilePath.delete(FilePath.java:1670)
	at hudson.tasks.CommandInterpreter.perform(CommandInterpreter.java:162)
	at hudson.tasks.CommandInterpreter.perform(CommandInterpreter.java:91)
	at hudson.tasks.BuildStepMonitor$1.perform(BuildStepMonitor.java:20)
	at hudson.model.AbstractBuild$AbstractBuildExecution.perform(AbstractBuild.java:803)
	at hudson.model.Build$BuildExecution.build(Build.java:197)
	at hudson.model.Build$BuildExecution.doRun(Build.java:163)
	at hudson.model.AbstractBuild$AbstractBuildExecution.run(AbstractBuild.java:513)
	at hudson.model.Run.execute(Run.java:1907)
	at hudson.matrix.MatrixRun.run(MatrixRun.java:153)
	at hudson.model.ResourceController.execute(ResourceController.java:97)
	at hudson.model.Executor.run(Executor.java:429)
Build step 'Execute shell' marked build as failure
ERROR: Step ‘[Deprecated] Scan for compiler warnings’ failed: no workspace for master-osmo-sgsn/IU=--enable-iu,WITH_MANUALS=0,a3=default,a4=default,label=osmocom-master-debian9 #27034


More information about the jenkins-notifications mailing list