Build failed in Jenkins: master-osmo-msc » --enable-iu,0,a3=default,a4=default,osmocom-master-debian9 #24803

jenkins at lists.osmocom.org jenkins at lists.osmocom.org
Tue Jun 8 08:42:52 UTC 2021


See <https://jenkins.osmocom.org/jenkins/job/master-osmo-msc/IU=--enable-iu,WITH_MANUALS=0,a3=default,a4=default,label=osmocom-master-debian9/24803/display/redirect>

Changes:


------------------------------------------
[...truncated 450.94 KB...]
src/tests/Makefile.am:20: but option 'subdir-objects' is disabled
+ ./configure --prefix=/build/deps/install/stow/osmo-iuh --with-systemdsystemunitdir=/build/deps/install/stow/osmo-iuh/lib/systemd/system
checking build system type... x86_64-pc-linux-gnu
checking host system type... x86_64-pc-linux-gnu
checking how to print strings... printf
checking for gcc... gcc
checking whether the C compiler works... yes
checking for C compiler default output file name... a.out
checking for suffix of executables... 
checking whether we are cross compiling... no
checking for suffix of object files... o
checking whether we are using the GNU C compiler... yes
checking whether gcc accepts -g... yes
checking for gcc option to accept ISO C89... none needed
checking whether gcc understands -c and -o together... yes
checking for a sed that does not truncate output... /bin/sed
checking for grep that handles long lines and -e... /bin/grep
checking for egrep... /bin/grep -E
checking for fgrep... /bin/grep -F
checking for ld used by gcc... /usr/bin/ld
checking if the linker (/usr/bin/ld) is GNU ld... yes
checking for BSD- or MS-compatible name lister (nm)... /usr/bin/nm -B
checking the name lister (/usr/bin/nm -B) interface... BSD nm
checking whether ln -s works... yes
checking the maximum length of command line arguments... 1572864
checking how to convert x86_64-pc-linux-gnu file names to x86_64-pc-linux-gnu format... func_convert_file_noop
checking how to convert x86_64-pc-linux-gnu file names to toolchain format... func_convert_file_noop
checking for /usr/bin/ld option to reload object files... -r
checking for objdump... objdump
checking how to recognize dependent libraries... pass_all
checking for dlltool... no
checking how to associate runtime and link libraries... printf %s\n
checking for ar... ar
checking for archiver @FILE support... @
checking for strip... strip
checking for ranlib... ranlib
checking for gawk... gawk
checking command to parse /usr/bin/nm -B output from gcc object... ok
checking for sysroot... no
checking for a working dd... /bin/dd
checking how to truncate binary pipes... /bin/dd bs=4096 count=1
checking for mt... no
checking if : is a manifest tool... no
checking how to run the C preprocessor... gcc -E
checking for ANSI C header files... yes
checking for sys/types.h... yes
checking for sys/stat.h... yes
checking for stdlib.h... yes
checking for string.h... yes
checking for memory.h... yes
checking for strings.h... yes
checking for inttypes.h... yes
checking for stdint.h... yes
checking for unistd.h... yes
checking for dlfcn.h... yes
checking for objdir... .libs
checking if gcc supports -fno-rtti -fno-exceptions... no
checking for gcc option to produce PIC... -fPIC -DPIC
checking if gcc PIC flag -fPIC -DPIC works... yes
checking if gcc static flag -static works... yes
checking if gcc supports -c -o file.o... yes
checking if gcc supports -c -o file.o... (cached) yes
checking whether the gcc linker (/usr/bin/ld -m elf_x86_64) supports shared libraries... yes
checking whether -lc should be explicitly linked in... no
checking dynamic linker characteristics... GNU/Linux ld.so
checking how to hardcode library paths into programs... immediate
checking whether stripping libraries is possible... yes
checking if libtool supports shared libraries... yes
checking whether to build shared libraries... yes
checking whether to build static libraries... yes
checking for a BSD-compatible install... /usr/bin/install -c
checking whether build environment is sane... yes
checking for a thread-safe mkdir -p... /bin/mkdir -p
checking whether make sets $(MAKE)... yes
checking for style of include used by make... GNU
checking whether make supports nested variables... yes
checking whether UID '1000' is supported by ustar format... yes
checking whether GID '1000' is supported by ustar format... yes
checking how to create a ustar tar archive... gnutar
checking dependency style of gcc... gcc3
checking whether make supports nested variables... (cached) yes
checking whether make sets $(MAKE)... (cached) yes
checking for gcc... (cached) gcc
checking whether we are using the GNU C compiler... (cached) yes
checking whether gcc accepts -g... (cached) yes
checking for gcc option to accept ISO C89... (cached) none needed
checking whether gcc understands -c and -o together... (cached) yes
checking netinet/sctp.h usability... yes
checking netinet/sctp.h presence... yes
checking for netinet/sctp.h... yes
checking for pkg-config... /usr/bin/pkg-config
checking for pkg-config... /usr/bin/pkg-config
checking pkg-config is at least version 0.20... yes
checking for OSMOCORE... yes
checking for OSMOGSM... yes
checking for OSMOVTY... yes
checking for OSMOCTRL... yes
checking for OSMONETIF... yes
checking for OSMOSIGTRAN... yes
checking for ASN1C... yes
checking for ANSI C header files... (cached) yes
CFLAGS="-g -O2 -std=gnu11 -Wall"
CPPFLAGS=" -Wall"
checking that generated files are newer than configure... done
configure: creating ./config.status
config.status: creating libosmo-ranap.pc
config.status: creating libosmo-sabp.pc
config.status: creating src/Makefile
config.status: creating src/hnbap/Makefile
config.status: creating src/ranap/Makefile
config.status: creating src/rua/Makefile
config.status: creating src/sabp/Makefile
config.status: creating src/tests/Makefile
config.status: creating Makefile
config.status: creating include/Makefile
config.status: creating include/osmocom/Makefile
config.status: creating include/osmocom/hnbap/Makefile
config.status: creating include/osmocom/ranap/Makefile
config.status: creating include/osmocom/rua/Makefile
config.status: creating include/osmocom/sabp/Makefile
config.status: creating include/osmocom/iuh/Makefile
config.status: creating doc/Makefile
config.status: creating doc/examples/Makefile
config.status: creating doc/manuals/Makefile
config.status: creating contrib/Makefile
config.status: creating contrib/systemd/Makefile
config.status: creating contrib/osmo-iuh.spec
config.status: executing libtool commands
config.status: executing depfiles commands
config.status: executing src/tests/atconfig commands
+ [ -n  ]
+ make -j 4 install
echo 0.7.0.3-7fcd > .version-t && mv .version-t .version
make  install-recursive
make[1]: Entering directory '/build/deps/osmo-iuh'
Making install in src
make[2]: Entering directory '/build/deps/osmo-iuh/src'
../asn1/utils/asn1tostruct.py -f ../asn1/hnbap/HNBAP-PDU-Contents.asn
../asn1/utils/asn1tostruct.py -p RUA_ -f ../asn1/rua/RUA-PDU-Contents.asn
../asn1/utils/asn1tostruct.py -p SABP_ -f ../asn1/sabp/SABP-PDU-Contents.asn
../asn1/utils/asn1tostruct.py -p RANAP_ -f ../asn1/ranap/RANAP-PDU-Contents.asn
Didn't find any information element for message: PrivateMessage-IEs
sed -i 's,^#include "rua_ies_defs.h",#include <osmocom/rua/rua_ies_defs.h>,' rua_encoder.c rua_decoder.c
Didn't find any information element for message: PrivateMessage-IEs
sed -i 's,^#include "hnbap_ies_defs.h",#include <osmocom/hnbap/hnbap_ies_defs.h>,' hnbap_encoder.c hnbap_decoder.c
sed -i 's,^#include "sabp_ies_defs.h",#include <osmocom/sabp/sabp_ies_defs.h>,' sabp_encoder.c sabp_decoder.c
sed -i 's,^#include "rua_common.h",#include <osmocom/rua/rua_common.h>,' rua_encoder.c rua_decoder.c rua_ies_defs.h
sed -i 's,^#include "hnbap_common.h",#include <osmocom/hnbap/hnbap_common.h>,' hnbap_encoder.c hnbap_decoder.c hnbap_ies_defs.h
sed -i 's,^#include "sabp_common.h",#include <osmocom/sabp/sabp_common.h>,' sabp_encoder.c sabp_decoder.c sabp_ies_defs.h
mv rua_ies_defs.h ../include/osmocom/rua/
touch ../src/gen_rua.stamp
mv hnbap_ies_defs.h ../include/osmocom/hnbap/
touch ../src/gen_hnbap.stamp
mv sabp_ies_defs.h ../include/osmocom/sabp/
touch ../src/gen_sabp.stamp
Didn't find any information element for message: RelocationDetectIEs
Didn't find any information element for message: RelocationCompleteIEs
Didn't find any information element for message: RAB-SetupOrModifyItem-IEs
Didn't find any information element for message: PrivateMessage-IEs
Didn't find any information element for message: DirectTransferInformationItemIEs-RANAP-RelocInf
Didn't find any information element for message: SRVCC-CSKeysRequestIEs
Didn't find any information element for message: UeRadioCapabilityMatchRequestIEs
sed -i 's,^#include "ranap_ies_defs.h",#include <osmocom/ranap/ranap_ies_defs.h>,' ranap_encoder.c ranap_decoder.c
sed -i 's,^#include "ranap_common.h",#include <osmocom/ranap/ranap_common.h>,' ranap_encoder.c ranap_decoder.c ranap_ies_defs.h
mv ranap_ies_defs.h ../include/osmocom/ranap/
touch ../src/gen_ranap.stamp
make  install-recursive
make[3]: Entering directory '/build/deps/osmo-iuh/src'
Making install in hnbap
make[4]: Entering directory '/build/deps/osmo-iuh/src/hnbap'
  CC       PrivateIE-ID.o
  CC       Criticality.o
  CC       Presence.o
  CC       ProcedureCode.o
  CC       ProtocolIE-ID.o
  CC       TriggeringMessage.o
  CC       IE-Extensions.o
  CC       Access-stratum-release-indicator.o
  CC       AccessResult.o
  CC       AltitudeAndDirection.o
  CC       BackoffTimer.o
  CC       BindingID.o
  CC       Cause.o
  CC       CauseRadioNetwork.o
  CC       CauseTransport.o
  CC       CauseMisc.o
  CC       CauseProtocol.o
FATAL: command execution failed
java.io.EOFException
	at java.io.ObjectInputStream$PeekInputStream.readFully(ObjectInputStream.java:2799)
	at java.io.ObjectInputStream$BlockDataInputStream.readShort(ObjectInputStream.java:3274)
	at java.io.ObjectInputStream.readStreamHeader(ObjectInputStream.java:934)
	at java.io.ObjectInputStream.<init>(ObjectInputStream.java:396)
	at hudson.remoting.ObjectInputStreamEx.<init>(ObjectInputStreamEx.java:49)
	at hudson.remoting.Command.readFrom(Command.java:142)
	at hudson.remoting.Command.readFrom(Command.java:128)
	at hudson.remoting.AbstractSynchronousByteArrayCommandTransport.read(AbstractSynchronousByteArrayCommandTransport.java:35)
	at hudson.remoting.SynchronousCommandTransport$ReaderThread.run(SynchronousCommandTransport.java:61)
Caused: java.io.IOException: Unexpected termination of the channel
	at hudson.remoting.SynchronousCommandTransport$ReaderThread.run(SynchronousCommandTransport.java:75)
Caused: java.io.IOException: Backing channel 'gtp0-deb9build' is disconnected.
	at hudson.remoting.RemoteInvocationHandler.channelOrFail(RemoteInvocationHandler.java:216)
	at hudson.remoting.RemoteInvocationHandler.invoke(RemoteInvocationHandler.java:286)
	at com.sun.proxy.$Proxy64.isAlive(Unknown Source)
	at hudson.Launcher$RemoteLauncher$ProcImpl.isAlive(Launcher.java:1211)
	at hudson.Launcher$RemoteLauncher$ProcImpl.join(Launcher.java:1203)
	at hudson.tasks.CommandInterpreter.join(CommandInterpreter.java:194)
	at hudson.tasks.CommandInterpreter.perform(CommandInterpreter.java:144)
	at hudson.tasks.CommandInterpreter.perform(CommandInterpreter.java:91)
	at hudson.tasks.BuildStepMonitor$1.perform(BuildStepMonitor.java:20)
	at hudson.model.AbstractBuild$AbstractBuildExecution.perform(AbstractBuild.java:803)
	at hudson.model.Build$BuildExecution.build(Build.java:197)
	at hudson.model.Build$BuildExecution.doRun(Build.java:163)
	at hudson.model.AbstractBuild$AbstractBuildExecution.run(AbstractBuild.java:513)
	at hudson.model.Run.execute(Run.java:1907)
	at hudson.matrix.MatrixRun.run(MatrixRun.java:153)
	at hudson.model.ResourceController.execute(ResourceController.java:97)
	at hudson.model.Executor.run(Executor.java:429)
FATAL: Unable to delete script file /tmp/jenkins4150221414768917926.sh
java.io.EOFException
	at java.io.ObjectInputStream$PeekInputStream.readFully(ObjectInputStream.java:2799)
	at java.io.ObjectInputStream$BlockDataInputStream.readShort(ObjectInputStream.java:3274)
	at java.io.ObjectInputStream.readStreamHeader(ObjectInputStream.java:934)
	at java.io.ObjectInputStream.<init>(ObjectInputStream.java:396)
	at hudson.remoting.ObjectInputStreamEx.<init>(ObjectInputStreamEx.java:49)
	at hudson.remoting.Command.readFrom(Command.java:142)
	at hudson.remoting.Command.readFrom(Command.java:128)
	at hudson.remoting.AbstractSynchronousByteArrayCommandTransport.read(AbstractSynchronousByteArrayCommandTransport.java:35)
	at hudson.remoting.SynchronousCommandTransport$ReaderThread.run(SynchronousCommandTransport.java:61)
Caused: java.io.IOException: Unexpected termination of the channel
	at hudson.remoting.SynchronousCommandTransport$ReaderThread.run(SynchronousCommandTransport.java:75)
Caused: hudson.remoting.ChannelClosedException: Channel "hudson.remoting.Channel at 18e263ed:gtp0-deb9build": Remote call on gtp0-deb9build failed. The channel is closing down or has closed down
	at hudson.remoting.Channel.call(Channel.java:994)
	at hudson.FilePath.act(FilePath.java:1158)
	at hudson.FilePath.act(FilePath.java:1147)
	at hudson.FilePath.delete(FilePath.java:1670)
	at hudson.tasks.CommandInterpreter.perform(CommandInterpreter.java:162)
	at hudson.tasks.CommandInterpreter.perform(CommandInterpreter.java:91)
	at hudson.tasks.BuildStepMonitor$1.perform(BuildStepMonitor.java:20)
	at hudson.model.AbstractBuild$AbstractBuildExecution.perform(AbstractBuild.java:803)
	at hudson.model.Build$BuildExecution.build(Build.java:197)
	at hudson.model.Build$BuildExecution.doRun(Build.java:163)
	at hudson.model.AbstractBuild$AbstractBuildExecution.run(AbstractBuild.java:513)
	at hudson.model.Run.execute(Run.java:1907)
	at hudson.matrix.MatrixRun.run(MatrixRun.java:153)
	at hudson.model.ResourceController.execute(ResourceController.java:97)
	at hudson.model.Executor.run(Executor.java:429)
Build step 'Execute shell' marked build as failure
ERROR: Step ‘[Deprecated] Scan for compiler warnings’ failed: no workspace for master-osmo-msc/IU=--enable-iu,WITH_MANUALS=0,a3=default,a4=default,label=osmocom-master-debian9 #24803


More information about the jenkins-notifications mailing list