Build failed in Jenkins: master-osmo-pcu » master,1,osmocom-master-debian9,none,False #3923

jenkins at lists.osmocom.org jenkins at lists.osmocom.org
Thu Jun 3 07:31:06 UTC 2021


See <https://jenkins.osmocom.org/jenkins/job/master-osmo-pcu/FIRMWARE_VERSION=master,WITH_MANUALS=1,label=osmocom-master-debian9,with_dsp=none,with_vty=False/3923/display/redirect>

Changes:


------------------------------------------
[...truncated 204.62 KB...]
make[3]: Entering directory '/build/osmo-pcu-0.9.0.111-d65b/_build/sub/doc/examples'
 ( cd '/tmp/am-dc-28886//build/osmo-pcu-0.9.0.111-d65b/_inst/share/doc/osmo-pcu/examples/osmo-pcu' && rm -f osmo-pcu.cfg )
 ( cd '/tmp/am-dc-28886//build/osmo-pcu-0.9.0.111-d65b/_inst/etc/osmocom' && rm -f osmo-pcu.cfg )
make[3]: Leaving directory '/build/osmo-pcu-0.9.0.111-d65b/_build/sub/doc/examples'
Making uninstall in manuals
make[3]: Entering directory '/build/osmo-pcu-0.9.0.111-d65b/_build/sub/doc/manuals'
if [ "" != "1" ]; then \
	for i in osmopcu-usermanual.pdf osmopcu-gb.pdf osmopcu-vty-reference.pdf; do \
		rm -v "/tmp/am-dc-28886//build/osmo-pcu-0.9.0.111-d65b/_inst/share/doc/osmo-pcu-doc/$i"; \
	done; \
fi
removed '/tmp/am-dc-28886//build/osmo-pcu-0.9.0.111-d65b/_inst/share/doc/osmo-pcu-doc/osmopcu-usermanual.pdf'
removed '/tmp/am-dc-28886//build/osmo-pcu-0.9.0.111-d65b/_inst/share/doc/osmo-pcu-doc/osmopcu-gb.pdf'
removed '/tmp/am-dc-28886//build/osmo-pcu-0.9.0.111-d65b/_inst/share/doc/osmo-pcu-doc/osmopcu-vty-reference.pdf'
make[3]: Leaving directory '/build/osmo-pcu-0.9.0.111-d65b/_build/sub/doc/manuals'
make[3]: Entering directory '/build/osmo-pcu-0.9.0.111-d65b/_build/sub/doc'
make[3]: Nothing to be done for 'uninstall-am'.
make[3]: Leaving directory '/build/osmo-pcu-0.9.0.111-d65b/_build/sub/doc'
make[2]: Leaving directory '/build/osmo-pcu-0.9.0.111-d65b/_build/sub/doc'
Making uninstall in tests
make[2]: Entering directory '/build/osmo-pcu-0.9.0.111-d65b/_build/sub/tests'
make[2]: Nothing to be done for 'uninstall'.
make[2]: Leaving directory '/build/osmo-pcu-0.9.0.111-d65b/_build/sub/tests'
Making uninstall in contrib
make[2]: Entering directory '/build/osmo-pcu-0.9.0.111-d65b/_build/sub/contrib'
Making uninstall in systemd
make[3]: Entering directory '/build/osmo-pcu-0.9.0.111-d65b/_build/sub/contrib/systemd'
 ( cd '/tmp/am-dc-28886//build/osmo-pcu-0.9.0.111-d65b/_inst//lib/systemd/system' && rm -f osmo-pcu.service )
make[3]: Leaving directory '/build/osmo-pcu-0.9.0.111-d65b/_build/sub/contrib/systemd'
make[3]: Entering directory '/build/osmo-pcu-0.9.0.111-d65b/_build/sub/contrib'
make[3]: Nothing to be done for 'uninstall-am'.
make[3]: Leaving directory '/build/osmo-pcu-0.9.0.111-d65b/_build/sub/contrib'
make[2]: Leaving directory '/build/osmo-pcu-0.9.0.111-d65b/_build/sub/contrib'
make[2]: Entering directory '/build/osmo-pcu-0.9.0.111-d65b/_build/sub'
make[2]: Nothing to be done for 'uninstall-am'.
make[2]: Leaving directory '/build/osmo-pcu-0.9.0.111-d65b/_build/sub'
make[1]: Leaving directory '/build/osmo-pcu-0.9.0.111-d65b/_build/sub'
make[1]: Entering directory '/build/osmo-pcu-0.9.0.111-d65b/_build/sub'
make[1]: Leaving directory '/build/osmo-pcu-0.9.0.111-d65b/_build/sub'
make[1]: Entering directory '/build/osmo-pcu-0.9.0.111-d65b/_build/sub'
make  dist-bzip2 dist-gzip am__post_remove_distdir='@:'
make[2]: Entering directory '/build/osmo-pcu-0.9.0.111-d65b/_build/sub'
if test -d "osmo-pcu-0.9.0.111-d65b"; then find "osmo-pcu-0.9.0.111-d65b" -type d ! -perm -200 -exec chmod u+w {} ';' && rm -rf "osmo-pcu-0.9.0.111-d65b" || { sleep 5 && rm -rf "osmo-pcu-0.9.0.111-d65b"; }; else :; fi
test -d "osmo-pcu-0.9.0.111-d65b" || mkdir "osmo-pcu-0.9.0.111-d65b"
 (cd include && make  top_distdir=../osmo-pcu-0.9.0.111-d65b distdir=../osmo-pcu-0.9.0.111-d65b/include \
     am__remove_distdir=: am__skip_length_check=: am__skip_mode_fix=: distdir)
make[3]: Entering directory '/build/osmo-pcu-0.9.0.111-d65b/_build/sub/include'
make[3]: Leaving directory '/build/osmo-pcu-0.9.0.111-d65b/_build/sub/include'
 (cd src && make  top_distdir=../osmo-pcu-0.9.0.111-d65b distdir=../osmo-pcu-0.9.0.111-d65b/src \
     am__remove_distdir=: am__skip_length_check=: am__skip_mode_fix=: distdir)
make[3]: Entering directory '/build/osmo-pcu-0.9.0.111-d65b/_build/sub/src'
make[3]: Leaving directory '/build/osmo-pcu-0.9.0.111-d65b/_build/sub/src'
 (cd doc && make  top_distdir=../osmo-pcu-0.9.0.111-d65b distdir=../osmo-pcu-0.9.0.111-d65b/doc \
     am__remove_distdir=: am__skip_length_check=: am__skip_mode_fix=: distdir)
make[3]: Entering directory '/build/osmo-pcu-0.9.0.111-d65b/_build/sub/doc'
 (cd examples && make  top_distdir=../../osmo-pcu-0.9.0.111-d65b distdir=../../osmo-pcu-0.9.0.111-d65b/doc/examples \
     am__remove_distdir=: am__skip_length_check=: am__skip_mode_fix=: distdir)
make[4]: Entering directory '/build/osmo-pcu-0.9.0.111-d65b/_build/sub/doc/examples'
make[4]: Leaving directory '/build/osmo-pcu-0.9.0.111-d65b/_build/sub/doc/examples'
 (cd manuals && make  top_distdir=../../osmo-pcu-0.9.0.111-d65b distdir=../../osmo-pcu-0.9.0.111-d65b/doc/manuals \
     am__remove_distdir=: am__skip_length_check=: am__skip_mode_fix=: distdir)
make[4]: Entering directory '/build/osmo-pcu-0.9.0.111-d65b/_build/sub/doc/manuals'
make[4]: Leaving directory '/build/osmo-pcu-0.9.0.111-d65b/_build/sub/doc/manuals'
make[3]: Leaving directory '/build/osmo-pcu-0.9.0.111-d65b/_build/sub/doc'
 (cd tests && make  top_distdir=../osmo-pcu-0.9.0.111-d65b distdir=../osmo-pcu-0.9.0.111-d65b/tests \
     am__remove_distdir=: am__skip_length_check=: am__skip_mode_fix=: distdir)
make[3]: Entering directory '/build/osmo-pcu-0.9.0.111-d65b/_build/sub/tests'
make[3]: Leaving directory '/build/osmo-pcu-0.9.0.111-d65b/_build/sub/tests'
 (cd contrib && make  top_distdir=../osmo-pcu-0.9.0.111-d65b distdir=../osmo-pcu-0.9.0.111-d65b/contrib \
     am__remove_distdir=: am__skip_length_check=: am__skip_mode_fix=: distdir)
make[3]: Entering directory '/build/osmo-pcu-0.9.0.111-d65b/_build/sub/contrib'
 (cd systemd && make  top_distdir=../../osmo-pcu-0.9.0.111-d65b distdir=../../osmo-pcu-0.9.0.111-d65b/contrib/systemd \
     am__remove_distdir=: am__skip_length_check=: am__skip_mode_fix=: distdir)
make[4]: Entering directory '/build/osmo-pcu-0.9.0.111-d65b/_build/sub/contrib/systemd'
make[4]: Leaving directory '/build/osmo-pcu-0.9.0.111-d65b/_build/sub/contrib/systemd'
make[3]: Leaving directory '/build/osmo-pcu-0.9.0.111-d65b/_build/sub/contrib'
test -n "" \
|| find "osmo-pcu-0.9.0.111-d65b" -type d ! -perm -755 \
	-exec chmod u+rwx,go+rx {} \; -o \
  ! -type d ! -perm -444 -links 1 -exec chmod a+r {} \; -o \
  ! -type d ! -perm -400 -exec chmod a+r {} \; -o \
  ! -type d ! -perm -444 -exec /bin/bash /build/osmo-pcu-0.9.0.111-d65b/install-sh -c -m a+r {} {} \; \
|| chmod -R a+r "osmo-pcu-0.9.0.111-d65b"
tardir=osmo-pcu-0.9.0.111-d65b && ${TAR-tar} chof - "$tardir" | BZIP2=${BZIP2--9} bzip2 -c >osmo-pcu-0.9.0.111-d65b.tar.bz2
tardir=osmo-pcu-0.9.0.111-d65b && ${TAR-tar} chof - "$tardir" | GZIP=--best gzip -c >osmo-pcu-0.9.0.111-d65b.tar.gz
make[2]: Leaving directory '/build/osmo-pcu-0.9.0.111-d65b/_build/sub'
if test -d "osmo-pcu-0.9.0.111-d65b"; then find "osmo-pcu-0.9.0.111-d65b" -type d ! -perm -200 -exec chmod u+w {} ';' && rm -rf "osmo-pcu-0.9.0.111-d65b" || { sleep 5 && rm -rf "osmo-pcu-0.9.0.111-d65b"; }; else :; fi
make[1]: Leaving directory '/build/osmo-pcu-0.9.0.111-d65b/_build/sub'
make[1]: Entering directory '/build/osmo-pcu-0.9.0.111-d65b/_build/sub'
Making distclean in include
make[2]: Entering directory '/build/osmo-pcu-0.9.0.111-d65b/_build/sub/include'
rm -rf .libs _libs
rm -f *.lo
test -z "" || rm -f 
rm -f TAGS ID GTAGS GRTAGS GSYMS GPATH tags
test . = "../../../include" || test -z "" || rm -f 
rm -f Makefile
make[2]: Leaving directory '/build/osmo-pcu-0.9.0.111-d65b/_build/sub/include'
Making distclean in src
make[2]: Entering directory '/build/osmo-pcu-0.9.0.111-d65b/_build/sub/src'
rm -rf .libs _libs
test -z "libgprs.la" || rm -f libgprs.la
 rm -f osmo-pcu
rm -f *.o
rm -f *.lo
rm -f *.tab.c
rm -f ./so_locations
test -z "" || rm -f 
rm -f TAGS ID GTAGS GRTAGS GSYMS GPATH tags
rm -f osmo-bts-litecell15/*.o
test . = "../../../src" || test -z "" || rm -f 
rm -f osmo-bts-litecell15/.deps/.dirstamp
rm -f osmo-bts-oc2g/*.o
rm -f osmo-bts-litecell15/.dirstamp
rm -f osmo-bts-sysmo/*.o
rm -f osmo-bts-oc2g/.deps/.dirstamp
rm -f osmo-bts-oc2g/.dirstamp
rm -f osmo-bts-sysmo/.deps/.dirstamp
rm -f osmo-bts-sysmo/.dirstamp
rm -rf ./.deps osmo-bts-litecell15/.deps osmo-bts-oc2g/.deps osmo-bts-sysmo/.deps
rm -f Makefile
make[2]: Leaving directory '/build/osmo-pcu-0.9.0.111-d65b/_build/sub/src'
Making distclean in doc
make[2]: Entering directory '/build/osmo-pcu-0.9.0.111-d65b/_build/sub/doc'
Making distclean in examples
make[3]: Entering directory '/build/osmo-pcu-0.9.0.111-d65b/_build/sub/doc/examples'
rm -rf .libs _libs
rm -f *.lo
test -z "" || rm -f 
test . = "../../../../doc/examples" || test -z "" || rm -f 
rm -f Makefile
make[3]: Leaving directory '/build/osmo-pcu-0.9.0.111-d65b/_build/sub/doc/examples'
Making distclean in manuals
make[3]: Entering directory '/build/osmo-pcu-0.9.0.111-d65b/_build/sub/doc/manuals'
rm -rf .libs _libs
rm -f *.lo
test -z "" || rm -f 
rm -rf osmopcu-usermanual__*.png osmopcu-gb__*.png osmopcu-usermanual__*.svg osmopcu-gb__*.svg osmopcu-usermanual.check osmopcu-gb.check osmopcu-usermanual.pdf osmopcu-gb.pdf osmopcu-usermanual.html osmopcu-gb.html osmopcu-vty-reference.pdf osmopcu-vty-reference.lint generated ./vty/pcu_vty_reference.xml common build
test . = "../../../../doc/manuals" || test -z "" || rm -f 
rm -f Makefile
make[3]: Leaving directory '/build/osmo-pcu-0.9.0.111-d65b/_build/sub/doc/manuals'
make[3]: Entering directory '/build/osmo-pcu-0.9.0.111-d65b/_build/sub/doc'
rm -rf .libs _libs
rm -f *.lo
test -z "" || rm -f 
rm -f TAGS ID GTAGS GRTAGS GSYMS GPATH tags
test . = "../../../doc" || test -z "" || rm -f 
make[3]: Leaving directory '/build/osmo-pcu-0.9.0.111-d65b/_build/sub/doc'
rm -f Makefile
make[2]: Leaving directory '/build/osmo-pcu-0.9.0.111-d65b/_build/sub/doc'
Making distclean in tests
make[2]: Entering directory '/build/osmo-pcu-0.9.0.111-d65b/_build/sub/tests'
rm -rf .libs _libs
test ! -f '../../../tests/testsuite' || \
	/bin/bash '../../../tests/testsuite' --clean
 rm -f rlcmac/RLCMACTest alloc/AllocTest alloc/MslotTest tbf/TbfTest types/TypesTest ms/MsTest llist/LListTest llc/LlcTest codel/codel_test edge/EdgeTest bitcomp/BitcompTest fn/FnTest app_info/AppInfoTest ulc/PdchUlcTest
rm -rf alloc/.libs alloc/_libs
 rm -f emu/pcu_emu
rm -f *.o
rm -rf app_info/.libs app_info/_libs
rm -rf bitcomp/.libs bitcomp/_libs
rm -f *.lo
rm -rf codel/.libs codel/_libs
rm -f *.tab.c
rm -rf edge/.libs edge/_libs
test -z "" || rm -f 
rm -f TAGS ID GTAGS GRTAGS GSYMS GPATH tags
test . = "../../../tests" || test -z "" || rm -f 
rm -rf emu/.libs emu/_libs
rm -f alloc/.dirstamp
rm -rf fn/.libs fn/_libs
rm -f app_info/.dirstamp
rm -rf llc/.libs llc/_libs
rm -f bitcomp/.dirstamp
rm -rf llist/.libs llist/_libs
rm -f codel/.dirstamp
rm -rf ms/.libs ms/_libs
rm -f edge/.dirstamp
rm -rf rlcmac/.libs rlcmac/_libs
rm -f emu/.dirstamp
rm -rf tbf/.libs tbf/_libs
rm -f fn/.dirstamp
rm -f llc/.dirstamp
rm -rf types/.libs types/_libs
rm -f llist/.dirstamp
rm -rf ulc/.libs ulc/_libs
rm -f ms/.dirstamp
rm -f rlcmac/.dirstamp
rm -f tbf/.dirstamp
rm -f types/.dirstamp
rm -f ulc/.dirstamp
test -z "atconfig" || rm -f atconfig
rm -rf ./.deps
rm -f Makefile
make[2]: Leaving directory '/build/osmo-pcu-0.9.0.111-d65b/_build/sub/tests'
Making distclean in contrib
make[2]: Entering directory '/build/osmo-pcu-0.9.0.111-d65b/_build/sub/contrib'
Making distclean in systemd
make[3]: Entering directory '/build/osmo-pcu-0.9.0.111-d65b/_build/sub/contrib/systemd'
rm -rf .libs _libs
rm -f *.lo
test -z "" || rm -f 
test . = "../../../../contrib/systemd" || test -z "" || rm -f 
rm -f Makefile
make[3]: Leaving directory '/build/osmo-pcu-0.9.0.111-d65b/_build/sub/contrib/systemd'
make[3]: Entering directory '/build/osmo-pcu-0.9.0.111-d65b/_build/sub/contrib'
rm -rf .libs _libs
rm -f *.lo
test -z "osmo-pcu.spec" || rm -f osmo-pcu.spec
rm -f TAGS ID GTAGS GRTAGS GSYMS GPATH tags
test . = "../../../contrib" || test -z "" || rm -f 
make[3]: Leaving directory '/build/osmo-pcu-0.9.0.111-d65b/_build/sub/contrib'
rm -f Makefile
make[2]: Leaving directory '/build/osmo-pcu-0.9.0.111-d65b/_build/sub/contrib'
make[2]: Entering directory '/build/osmo-pcu-0.9.0.111-d65b/_build/sub'
rm -rf .libs _libs
rm -f *.lo
test -z "" || rm -f 
rm -f libtool config.lt
rm -f TAGS ID GTAGS GRTAGS GSYMS GPATH tags
test . = "../.." || test -z "" || rm -f 
rm -f cscope.out cscope.in.out cscope.po.out cscope.files
make[2]: Leaving directory '/build/osmo-pcu-0.9.0.111-d65b/_build/sub'
rm -f config.status config.cache config.log configure.lineno config.status.lineno
rm -f Makefile
make[1]: Leaving directory '/build/osmo-pcu-0.9.0.111-d65b/_build/sub'
if test -d "osmo-pcu-0.9.0.111-d65b"; then find "osmo-pcu-0.9.0.111-d65b" -type d ! -perm -200 -exec chmod u+w {} ';' && rm -rf "osmo-pcu-0.9.0.111-d65b" || { sleep 5 && rm -rf "osmo-pcu-0.9.0.111-d65b"; }; else :; fi
=========================================================
osmo-pcu-0.9.0.111-d65b archives ready for distribution: 
osmo-pcu-0.9.0.111-d65b.tar.gz
osmo-pcu-0.9.0.111-d65b.tar.bz2
=========================================================
+ [ 1 = 1 ]
+ [ 1 = 1 ]
+ make -C /build/doc/manuals publish
make: Entering directory '/build/doc/manuals'
rsync -avz -e "ssh -o 'UserKnownHostsFile=/opt/osmo-gsm-manuals/build/known_hosts' -p 48" osmopcu-usermanual.pdf osmopcu-gb.pdf osmopcu-vty-reference.pdf docs at ftp.osmocom.org:web-files/latest/
Failed to add the ECDSA host key for IP address '[148.251.236.141]:48' to the list of known hosts (/opt/osmo-gsm-manuals/build/known_hosts).
sending incremental file list
osmopcu-gb.pdf
osmopcu-usermanual.pdf
osmopcu-vty-reference.pdf
rsync: write failed on "/downloads/home/docs/web-files/latest/osmopcu-gb.pdf": No space left on device (28)
rsync error: error in file IO (code 11) at receiver.c(374) [receiver=3.1.3]
/opt/osmo-gsm-manuals/build/Makefile.common.inc:31: recipe for target 'publish' failed
make: Leaving directory '/build/doc/manuals'
make: *** [publish] Error 11
Build step 'Execute shell' marked build as failure
[WARNINGS]Skipping publisher since build result is FAILURE


More information about the jenkins-notifications mailing list