Build failed in Jenkins: master-osmo-msc » --disable-iu,1,a3=default,a4=default,osmocom-master-debian9 #24705

jenkins at lists.osmocom.org jenkins at lists.osmocom.org
Thu Jun 3 03:52:30 UTC 2021


See <https://jenkins.osmocom.org/jenkins/job/master-osmo-msc/IU=--disable-iu,WITH_MANUALS=1,a3=default,a4=default,label=osmocom-master-debian9/24705/display/redirect>

Changes:


------------------------------------------
[...truncated 800.04 KB...]
make[3]: Leaving directory '/build/osmo-msc-1.7.0.4-67106/_build/sub/include'
rm -f Makefile
make[2]: Leaving directory '/build/osmo-msc-1.7.0.4-67106/_build/sub/include'
Making distclean in src
make[2]: Entering directory '/build/osmo-msc-1.7.0.4-67106/_build/sub/src'
Making distclean in libvlr
make[3]: Entering directory '/build/osmo-msc-1.7.0.4-67106/_build/sub/src/libvlr'
rm -rf .libs _libs
test -z "libvlr.a" || rm -f libvlr.a
rm -f *.o
rm -f *.lo
rm -f *.tab.c
test -z "" || rm -f 
rm -f TAGS ID GTAGS GRTAGS GSYMS GPATH tags
test . = "../../../../src/libvlr" || test -z "" || rm -f 
rm -rf ./.deps
rm -f Makefile
make[3]: Leaving directory '/build/osmo-msc-1.7.0.4-67106/_build/sub/src/libvlr'
Making distclean in libmsc
make[3]: Entering directory '/build/osmo-msc-1.7.0.4-67106/_build/sub/src/libmsc'
rm -rf .libs _libs
test -z "libmsc.a " || rm -f libmsc.a 
rm -f *.o
rm -f *.lo
rm -f *.tab.c
test -z "" || rm -f 
rm -f TAGS ID GTAGS GRTAGS GSYMS GPATH tags
test . = "../../../../src/libmsc" || test -z "" || rm -f 
rm -rf ./.deps
rm -f Makefile
make[3]: Leaving directory '/build/osmo-msc-1.7.0.4-67106/_build/sub/src/libmsc'
Making distclean in osmo-msc
make[3]: Entering directory '/build/osmo-msc-1.7.0.4-67106/_build/sub/src/osmo-msc'
rm -rf .libs _libs
rm -f *.o
rm -f *.lo
rm -f *.tab.c
test -z "" || rm -f 
rm -f TAGS ID GTAGS GRTAGS GSYMS GPATH tags
 rm -f osmo-msc
test . = "../../../../src/osmo-msc" || test -z "" || rm -f 
rm -rf ./.deps
rm -f Makefile
make[3]: Leaving directory '/build/osmo-msc-1.7.0.4-67106/_build/sub/src/osmo-msc'
Making distclean in utils
make[3]: Entering directory '/build/osmo-msc-1.7.0.4-67106/_build/sub/src/utils'
rm -rf .libs _libs
rm -f *.o
rm -f *.lo
rm -f *.tab.c
test -z "" || rm -f 
rm -f TAGS ID GTAGS GRTAGS GSYMS GPATH tags
 rm -f smpp_mirror
test . = "../../../../src/utils" || test -z "" || rm -f 
rm -rf ./.deps
rm -f Makefile
make[3]: Leaving directory '/build/osmo-msc-1.7.0.4-67106/_build/sub/src/utils'
make[3]: Entering directory '/build/osmo-msc-1.7.0.4-67106/_build/sub/src'
rm -rf .libs _libs
rm -f *.lo
test -z "" || rm -f 
rm -f TAGS ID GTAGS GRTAGS GSYMS GPATH tags
test . = "../../../src" || test -z "" || rm -f 
make[3]: Leaving directory '/build/osmo-msc-1.7.0.4-67106/_build/sub/src'
rm -f Makefile
make[2]: Leaving directory '/build/osmo-msc-1.7.0.4-67106/_build/sub/src'
Making distclean in doc
make[2]: Entering directory '/build/osmo-msc-1.7.0.4-67106/_build/sub/doc'
Making distclean in examples
make[3]: Entering directory '/build/osmo-msc-1.7.0.4-67106/_build/sub/doc/examples'
rm -rf .libs _libs
rm -f *.lo
test -z "" || rm -f 
test . = "../../../../doc/examples" || test -z "" || rm -f 
rm -f Makefile
make[3]: Leaving directory '/build/osmo-msc-1.7.0.4-67106/_build/sub/doc/examples'
Making distclean in manuals
make[3]: Entering directory '/build/osmo-msc-1.7.0.4-67106/_build/sub/doc/manuals'
rm -rf .libs _libs
rm -f *.lo
test -z "" || rm -f 
test . = "../../../../doc/manuals" || test -z "" || rm -f 
rm -rf osmomsc-usermanual__*.png osmomsc-usermanual__*.svg osmomsc-usermanual.check osmomsc-usermanual.pdf osmomsc-usermanual.html osmomsc-vty-reference.pdf osmomsc-vty-reference.lint generated ./vty/msc_vty_reference.xml common build
rm -f Makefile
make[3]: Leaving directory '/build/osmo-msc-1.7.0.4-67106/_build/sub/doc/manuals'
Making distclean in sequence_charts
make[3]: Entering directory '/build/osmo-msc-1.7.0.4-67106/_build/sub/doc/sequence_charts'
test -z "inter_bsc_ho.png inter_msc_ho.png mncc_call_fsm.png voice_call_full.png " || rm -f inter_bsc_ho.png inter_msc_ho.png mncc_call_fsm.png voice_call_full.png 
rm -rf .libs _libs
rm -f *.lo
test -z "" || rm -f 
test . = "../../../../doc/sequence_charts" || test -z "" || rm -f 
rm -f Makefile
make[3]: Leaving directory '/build/osmo-msc-1.7.0.4-67106/_build/sub/doc/sequence_charts'
make[3]: Entering directory '/build/osmo-msc-1.7.0.4-67106/_build/sub/doc'
rm -rf .libs _libs
rm -f *.lo
test -z "" || rm -f 
rm -f TAGS ID GTAGS GRTAGS GSYMS GPATH tags
test . = "../../../doc" || test -z "" || rm -f 
make[3]: Leaving directory '/build/osmo-msc-1.7.0.4-67106/_build/sub/doc'
rm -f Makefile
make[2]: Leaving directory '/build/osmo-msc-1.7.0.4-67106/_build/sub/doc'
Making distclean in contrib
make[2]: Entering directory '/build/osmo-msc-1.7.0.4-67106/_build/sub/contrib'
Making distclean in systemd
make[3]: Entering directory '/build/osmo-msc-1.7.0.4-67106/_build/sub/contrib/systemd'
rm -rf .libs _libs
rm -f *.lo
test -z "" || rm -f 
test . = "../../../../contrib/systemd" || test -z "" || rm -f 
rm -f Makefile
make[3]: Leaving directory '/build/osmo-msc-1.7.0.4-67106/_build/sub/contrib/systemd'
make[3]: Entering directory '/build/osmo-msc-1.7.0.4-67106/_build/sub/contrib'
rm -rf .libs _libs
rm -f *.lo
test -z "osmo-msc.spec" || rm -f osmo-msc.spec
rm -f TAGS ID GTAGS GRTAGS GSYMS GPATH tags
test . = "../../../contrib" || test -z "" || rm -f 
make[3]: Leaving directory '/build/osmo-msc-1.7.0.4-67106/_build/sub/contrib'
rm -f Makefile
make[2]: Leaving directory '/build/osmo-msc-1.7.0.4-67106/_build/sub/contrib'
Making distclean in tests
make[2]: Entering directory '/build/osmo-msc-1.7.0.4-67106/_build/sub/tests'
Making distclean in sms_queue
make[3]: Entering directory '/build/osmo-msc-1.7.0.4-67106/_build/sub/tests/sms_queue'
rm -rf .libs _libs
rm -f *.o
rm -f *.lo
rm -f *.tab.c
test -z "" || rm -f 
rm -f TAGS ID GTAGS GRTAGS GSYMS GPATH tags
 rm -f sms_queue_test
test . = "../../../../tests/sms_queue" || test -z "" || rm -f 
rm -rf ./.deps
rm -f Makefile
make[3]: Leaving directory '/build/osmo-msc-1.7.0.4-67106/_build/sub/tests/sms_queue'
Making distclean in msc_vlr
make[3]: Entering directory '/build/osmo-msc-1.7.0.4-67106/_build/sub/tests/msc_vlr'
rm -rf .libs _libs
rm -f *.o
rm -f *.lo
rm -f *.tab.c
test -z "" || rm -f 
 rm -f msc_vlr_test_no_authen msc_vlr_test_gsm_authen msc_vlr_test_gsm_ciph msc_vlr_test_umts_authen msc_vlr_test_authen_reuse msc_vlr_test_hlr_reject msc_vlr_test_hlr_timeout msc_vlr_test_ms_timeout msc_vlr_test_reject_concurrency msc_vlr_test_call msc_vlr_test_rest msc_vlr_test_ss
rm -f TAGS ID GTAGS GRTAGS GSYMS GPATH tags
test . = "../../../../tests/msc_vlr" || test -z "" || rm -f 
rm -rf ./.deps
rm -f Makefile
make[3]: Leaving directory '/build/osmo-msc-1.7.0.4-67106/_build/sub/tests/msc_vlr'
Making distclean in db_sms
make[3]: Entering directory '/build/osmo-msc-1.7.0.4-67106/_build/sub/tests/db_sms'
rm -rf .libs _libs
rm -f *.o
rm -f *.lo
rm -f *.tab.c
test -z "" || rm -f 
rm -f TAGS ID GTAGS GRTAGS GSYMS GPATH tags
 rm -f db_sms_test
test . = "../../../../tests/db_sms" || test -z "" || rm -f 
rm -rf ./.deps
rm -f Makefile
make[3]: Leaving directory '/build/osmo-msc-1.7.0.4-67106/_build/sub/tests/db_sms'
Making distclean in sdp_msg
make[3]: Entering directory '/build/osmo-msc-1.7.0.4-67106/_build/sub/tests/sdp_msg'
rm -rf .libs _libs
rm -f *.o
rm -f *.lo
rm -f *.tab.c
test -z "" || rm -f 
rm -f TAGS ID GTAGS GRTAGS GSYMS GPATH tags
 rm -f sdp_msg_test
test . = "../../../../tests/sdp_msg" || test -z "" || rm -f 
rm -rf ./.deps
rm -f Makefile
make[3]: Leaving directory '/build/osmo-msc-1.7.0.4-67106/_build/sub/tests/sdp_msg'
Making distclean in mncc
make[3]: Entering directory '/build/osmo-msc-1.7.0.4-67106/_build/sub/tests/mncc'
rm -rf .libs _libs
rm -f *.o
rm -f *.lo
rm -f *.tab.c
test -z "" || rm -f 
rm -f TAGS ID GTAGS GRTAGS GSYMS GPATH tags
 rm -f mncc_test
test . = "../../../../tests/mncc" || test -z "" || rm -f 
rm -rf ./.deps
rm -f Makefile
make[3]: Leaving directory '/build/osmo-msc-1.7.0.4-67106/_build/sub/tests/mncc'
Making distclean in smpp
make[3]: Entering directory '/build/osmo-msc-1.7.0.4-67106/_build/sub/tests/smpp'
rm -rf .libs _libs
rm -f *.o
rm -f *.lo
rm -f *.tab.c
test -z "" || rm -f 
rm -f TAGS ID GTAGS GRTAGS GSYMS GPATH tags
 rm -f smpp_test
test . = "../../../../tests/smpp" || test -z "" || rm -f 
rm -rf ./.deps
rm -f Makefile
make[3]: Leaving directory '/build/osmo-msc-1.7.0.4-67106/_build/sub/tests/smpp'
make[3]: Entering directory '/build/osmo-msc-1.7.0.4-67106/_build/sub/tests'
rm -rf .libs _libs
test ! -f '../../../tests/testsuite' || \
	/bin/bash '../../../tests/testsuite' --clean
rm -f *.lo
test -z "atlocal" || rm -f atlocal
rm -f TAGS ID GTAGS GRTAGS GSYMS GPATH tags
test . = "../../../tests" || test -z "" || rm -f 
test -z "atconfig " || rm -f atconfig 
make[3]: Leaving directory '/build/osmo-msc-1.7.0.4-67106/_build/sub/tests'
rm -f Makefile
make[2]: Leaving directory '/build/osmo-msc-1.7.0.4-67106/_build/sub/tests'
make[2]: Entering directory '/build/osmo-msc-1.7.0.4-67106/_build/sub'
rm -rf .libs _libs
rm -f *.lo
test -z "" || rm -f 
rm -f config.h stamp-h1
rm -f libtool config.lt
rm -f TAGS ID GTAGS GRTAGS GSYMS GPATH tags
test . = "../.." || test -z "" || rm -f 
rm -f cscope.out cscope.in.out cscope.po.out cscope.files
make[2]: Leaving directory '/build/osmo-msc-1.7.0.4-67106/_build/sub'
rm -f config.status config.cache config.log configure.lineno config.status.lineno
rm -f Makefile
make[1]: Leaving directory '/build/osmo-msc-1.7.0.4-67106/_build/sub'
if test -d "osmo-msc-1.7.0.4-67106"; then find "osmo-msc-1.7.0.4-67106" -type d ! -perm -200 -exec chmod u+w {} ';' && rm -rf "osmo-msc-1.7.0.4-67106" || { sleep 5 && rm -rf "osmo-msc-1.7.0.4-67106"; }; else :; fi
========================================================
osmo-msc-1.7.0.4-67106 archives ready for distribution: 
osmo-msc-1.7.0.4-67106.tar.gz
osmo-msc-1.7.0.4-67106.tar.bz2
========================================================
+ '[' 1 = 1 ']'
+ '[' 1 = 1 ']'
+ make -C /build/doc/manuals publish
make: Entering directory '/build/doc/manuals'
rsync -avz -e "ssh -o 'UserKnownHostsFile=/opt/osmo-gsm-manuals/build/known_hosts' -p 48" osmomsc-usermanual.pdf osmomsc-vty-reference.pdf docs at ftp.osmocom.org:web-files/latest/
Failed to add the ECDSA host key for IP address '[148.251.236.141]:48' to the list of known hosts (/opt/osmo-gsm-manuals/build/known_hosts).
sending incremental file list
osmomsc-usermanual.pdf
osmomsc-vty-reference.pdf
rsync: write failed on "/downloads/home/docs/web-files/latest/osmomsc-usermanual.pdf": No space left on device (28)
rsync error: error in file IO (code 11) at receiver.c(374) [receiver=3.1.3]
/opt/osmo-gsm-manuals/build/Makefile.common.inc:31: recipe for target 'publish' failed
make: Leaving directory '/build/doc/manuals'
make: *** [publish] Error 11
Build step 'Execute shell' marked build as failure
[WARNINGS]Skipping publisher since build result is FAILURE


More information about the jenkins-notifications mailing list