Build failed in Jenkins: master-osmo-sgsn » --disable-iu,1,a3=default,a4=default,osmocom-master-debian9 #23735

jenkins at lists.osmocom.org jenkins at lists.osmocom.org
Thu Jan 28 21:07:34 UTC 2021


See <https://jenkins.osmocom.org/jenkins/job/master-osmo-sgsn/IU=--disable-iu,WITH_MANUALS=1,a3=default,a4=default,label=osmocom-master-debian9/23735/display/redirect?page=changes>

Changes:

[dwillmann] manual/gbproxy: Update overview chapter

[dwillmann] Rename OsmoGbPROXY -> *Proxy

[dwillmann] manuals/gbproxy: Update configuration chapter

[dwillmann] manuals/gbproxy: Add osmo-bsc MSC pooling chapter from Neels as a base

[dwillmann] manuals/gbproxy: MSC -> SGSN for pooling chapter

[dwillmann] manuals/gbproxy: Move pooling to separate chapter


------------------------------------------
[...truncated 286.76 KB...]
xsltproc -o doclist.txt --xinclude --xincludestyle doclist.xsl /build/doc/manuals/osmosgsn-usermanual.xml
Build the listings...
xsltproc -o listings.xml --xinclude --xincludestyle --param current.dir '/build/doc/manuals' /usr/share/dblatex/xsl/common/mklistings.xsl /build/doc/manuals/osmosgsn-usermanual.xml
xsltproc -o osmosgsn-usermanual.rtex --xinclude --xincludestyle --param current.dir '/build/doc/manuals' --param listings.xml '/tmp/tmpuncl3j/listings.xml' /tmp/tmpuncl3j/custom.xsl /build/doc/manuals/osmosgsn-usermanual.xml
XSLT stylesheets DocBook - LaTeX 2e (0.3.9-3)
===================================================
Error: no ID for constraint linkend: ctrl_common_var.
XRef to nonexistent id: ctrl_common_var
Error: no ID for constraint linkend: bssgp:bss_ctx_packets:in.
XRef to nonexistent id: bssgp:bss_ctx_packets:in
Error: no ID for constraint linkend: bssgp:bss_ctx_packets:out.
XRef to nonexistent id: bssgp:bss_ctx_packets:out
Error: no ID for constraint linkend: bssgp:bss_ctx_bytes:in.
XRef to nonexistent id: bssgp:bss_ctx_bytes:in
Error: no ID for constraint linkend: bssgp:bss_ctx_bytes:out.
XRef to nonexistent id: bssgp:bss_ctx_bytes:out
Error: no ID for constraint linkend: bssgp:bss_ctx_blocked.
XRef to nonexistent id: bssgp:bss_ctx_blocked
Error: no ID for constraint linkend: bssgp:bss_ctx_discarded.
XRef to nonexistent id: bssgp:bss_ctx_discarded
Error: no ID for constraint linkend: bssgp:bss_ctx_status.
XRef to nonexistent id: bssgp:bss_ctx_status
Error: no ID for constraint linkend: sgsn_llc:dl_bytes.
XRef to nonexistent id: sgsn_llc:dl_bytes
Error: no ID for constraint linkend: sgsn_llc:ul_bytes.
XRef to nonexistent id: sgsn_llc:ul_bytes
Error: no ID for constraint linkend: sgsn_llc:dl_packets.
XRef to nonexistent id: sgsn_llc:dl_packets
Error: no ID for constraint linkend: sgsn_llc:ul_packets.
XRef to nonexistent id: sgsn_llc:ul_packets
Error: no ID for constraint linkend: sgsn_gprs:attach_requested.
XRef to nonexistent id: sgsn_gprs:attach_requested
Error: no ID for constraint linkend: sgsn_gprs:attach_accepted.
XRef to nonexistent id: sgsn_gprs:attach_accepted
Error: no ID for constraint linkend: sgsn_gprs:attach_rejected.
XRef to nonexistent id: sgsn_gprs:attach_rejected
Error: no ID for constraint linkend: sgsn_gprs:detach_requested.
XRef to nonexistent id: sgsn_gprs:detach_requested
Error: no ID for constraint linkend: sgsn_gprs:detach_acked.
XRef to nonexistent id: sgsn_gprs:detach_acked
Error: no ID for constraint linkend: sgsn_gprs:routing_area_requested.
XRef to nonexistent id: sgsn_gprs:routing_area_requested
Error: no ID for constraint linkend: sgsn_gprs:routing_area_requested.
XRef to nonexistent id: sgsn_gprs:routing_area_requested
Error: no ID for constraint linkend: sgsn_gprs:routing_area_requested.
XRef to nonexistent id: sgsn_gprs:routing_area_requested
Error: no ID for constraint linkend: sgsn_pdp:activate_requested.
XRef to nonexistent id: sgsn_pdp:activate_requested
Error: no ID for constraint linkend: sgsn_pdp:activate_rejected.
XRef to nonexistent id: sgsn_pdp:activate_rejected
Error: no ID for constraint linkend: sgsn_pdp:activate_accepted.
XRef to nonexistent id: sgsn_pdp:activate_accepted
Error: no ID for constraint linkend: sgsn_pdp:request_activated.
XRef to nonexistent id: sgsn_pdp:request_activated
Error: no ID for constraint linkend: sgsn_pdp:request_activate_rejected.
XRef to nonexistent id: sgsn_pdp:request_activate_rejected
Error: no ID for constraint linkend: sgsn_pdp:modify_requested.
XRef to nonexistent id: sgsn_pdp:modify_requested
Error: no ID for constraint linkend: sgsn_pdp:modify_accepted.
XRef to nonexistent id: sgsn_pdp:modify_accepted
Error: no ID for constraint linkend: sgsn_pdp:dl_deactivate_requested.
XRef to nonexistent id: sgsn_pdp:dl_deactivate_requested
Error: no ID for constraint linkend: sgsn_pdp:dl_deactivate_accepted.
XRef to nonexistent id: sgsn_pdp:dl_deactivate_accepted
Error: no ID for constraint linkend: sgsn_pdp:ul_deactivate_requested.
XRef to nonexistent id: sgsn_pdp:ul_deactivate_requested
Error: no ID for constraint linkend: sgsn_pdp:ul_deactivate_accepted.
XRef to nonexistent id: sgsn_pdp:ul_deactivate_accepted
Error: no ID for constraint linkend: ns:nsvc_packets:in.
XRef to nonexistent id: ns:nsvc_packets:in
Error: no ID for constraint linkend: ns:nsvc_packets:out.
XRef to nonexistent id: ns:nsvc_packets:out
Error: no ID for constraint linkend: ns:nsvc_bytes:in.
XRef to nonexistent id: ns:nsvc_bytes:in
Error: no ID for constraint linkend: ns:nsvc_bytes:out.
XRef to nonexistent id: ns:nsvc_bytes:out
Error: no ID for constraint linkend: ns:nsvc_blocked.
XRef to nonexistent id: ns:nsvc_blocked
Error: no ID for constraint linkend: ns:nsvc_dead.
XRef to nonexistent id: ns:nsvc_dead
Error: no ID for constraint linkend: ns:nsvc_replaced.
XRef to nonexistent id: ns:nsvc_replaced
Error: no ID for constraint linkend: ns:nsvc_nsei-chg.
XRef to nonexistent id: ns:nsvc_nsei-chg
Error: no ID for constraint linkend: ns:nsvc_inv-nsvci.
XRef to nonexistent id: ns:nsvc_inv-nsvci
Error: no ID for constraint linkend: ns:nsvc_inv-nsei.
XRef to nonexistent id: ns:nsvc_inv-nsei
Error: no ID for constraint linkend: ns:nsvc_lost:alive.
XRef to nonexistent id: ns:nsvc_lost:alive
Error: no ID for constraint linkend: ns:nsvc_lost:reset.
XRef to nonexistent id: ns:nsvc_lost:reset
Error: no ID for constraint linkend: ns.nsvc_alive.delay.
XRef to nonexistent id: ns.nsvc_alive.delay
Error: no ID for constraint linkend: ietf-rfc791.
XRef to nonexistent id: ietf-rfc791
Section level > 6 not well supported for bibliodiv
Error: no ID for constraint linkend: modified-vesion.
XRef to nonexistent id: modified-vesion
Image 'dblatex' not found
Cannot convert 'osmosgsn-usermanual__1.png' to pdf
Cannot convert './common/images/wireshark-gsmtap-log.png' to pdf
Cannot convert 'osmosgsn-usermanual__2.png' to pdf
Cannot convert 'osmosgsn-usermanual__3.png' to pdf
Cannot convert 'osmosgsn-usermanual__4.png' to pdf
Cannot convert 'osmosgsn-usermanual__5.png' to pdf
Cannot convert 'osmosgsn-usermanual__6.png' to pdf
Cannot convert 'osmosgsn-usermanual__7.png' to pdf
Cannot convert 'osmosgsn-usermanual__8.png' to pdf
Cannot convert 'osmosgsn-usermanual__9.png' to pdf
Cannot convert 'osmosgsn-usermanual__10.png' to pdf
Cannot convert 'osmosgsn-usermanual__11.png' to pdf
Cannot convert 'osmosgsn-usermanual__12.png' to pdf
Cannot convert 'osmosgsn-usermanual__13.png' to pdf
Cannot convert 'osmosgsn-usermanual__14.png' to pdf
Cannot convert 'osmosgsn-usermanual__15.png' to pdf
Cannot convert 'osmosgsn-usermanual__16.png' to pdf
Cannot convert 'osmosgsn-usermanual__17.png' to pdf
Cannot convert 'osmosgsn-usermanual__18.png' to pdf
Cannot convert 'osmosgsn-usermanual__19.png' to pdf
Cannot convert 'osmosgsn-usermanual__20.png' to pdf
Cannot convert 'osmosgsn-usermanual__21.png' to pdf
Cannot convert 'osmosgsn-usermanual__22.png' to pdf
Cannot convert 'osmosgsn-usermanual__23.png' to pdf
Cannot convert 'osmosgsn-usermanual__24.png' to pdf
Cannot convert 'osmosgsn-usermanual__25.png' to pdf
Cannot convert 'osmosgsn-usermanual__26.png' to pdf
Cannot convert 'osmosgsn-usermanual__27.png' to pdf
Cannot convert 'osmosgsn-usermanual__28.png' to pdf
Cannot convert 'osmosgsn-usermanual__29.png' to pdf
Cannot convert 'osmosgsn-usermanual__30.png' to pdf
Cannot convert 'osmosgsn-usermanual__31.png' to pdf
Cannot convert 'osmosgsn-usermanual__32.png' to pdf
Cannot convert 'osmosgsn-usermanual__33.png' to pdf
Cannot convert 'osmosgsn-usermanual__34.png' to pdf
Cannot convert 'osmosgsn-usermanual__35.png' to pdf
Cannot convert 'osmosgsn-usermanual__36.png' to pdf
Cannot convert 'osmosgsn-usermanual__37.png' to pdf
Cannot convert 'osmosgsn-usermanual__38.png' to pdf
Build osmosgsn-usermanual.pdf
built-in module pdftex registered
no support found for ifthen
no support found for ifxetex
no support found for fontspec
no support found for xltxtra
no support found for fontenc
no support found for inputenc
no support found for fancybox
built-in module makeidx registered
no support found for custom-dblatex
built-in module bibtopic registered
building additional files...
checking if compiling is necessary...
the output file doesn't exist
pdflatex -interaction=batchmode osmosgsn-usermanual.tex
running post-compilation scripts...
[index] the index file /tmp/tmpuncl3j/osmosgsn-usermanual.idx is empty
osmosgsn-usermanual.toc MD5 checksum changed
osmosgsn-usermanual.aux MD5 checksum changed
the /tmp/tmpuncl3j/osmosgsn-usermanual.toc file has changed
pdflatex -interaction=batchmode osmosgsn-usermanual.tex
running post-compilation scripts...
[index] the index file /tmp/tmpuncl3j/osmosgsn-usermanual.idx is empty
no new compilation is needed
running last-compilation scripts...
'osmosgsn-usermanual.pdf' successfully built

a2x: deleting /build/doc/manuals/osmosgsn-usermanual.xml
rm generated/docbook_osmogbproxy-vty-reference.xml
make[3]: Leaving directory '/build/doc/manuals'
make[3]: Entering directory '/build/doc'
make[3]: Nothing to be done for 'all-am'.
make[3]: Leaving directory '/build/doc'
make[2]: Leaving directory '/build/doc'
Making all in include
make[2]: Entering directory '/build/include'
Making all in osmocom
make[3]: Entering directory '/build/include/osmocom'
Making all in sgsn
make[4]: Entering directory '/build/include/osmocom/sgsn'
make[4]: Nothing to be done for 'all'.
make[4]: Leaving directory '/build/include/osmocom/sgsn'
make[4]: Entering directory '/build/include/osmocom'
make[4]: Nothing to be done for 'all-am'.
make[4]: Leaving directory '/build/include/osmocom'
make[3]: Leaving directory '/build/include/osmocom'
make[3]: Entering directory '/build/include'
make[3]: Nothing to be done for 'all-am'.
make[3]: Leaving directory '/build/include'
make[2]: Leaving directory '/build/include'
Making all in src
make[2]: Entering directory '/build/src'
Making all in gprs
make[3]: Entering directory '/build/src/gprs'
  CC       gprs_gb_parse.lo
  CC       gprs_llc_parse.lo
  CC       gprs_utils.lo
  CC       crc24.lo
  CC       sgsn_ares.lo
  CCLD     libcommon.la
ar: `u' modifier ignored since `D' is the default (see `U')
make[3]: Leaving directory '/build/src/gprs'
Making all in sgsn
make[3]: Entering directory '/build/src/sgsn'
  CC       gprs_gb.o
  CC       gprs_gmm_attach.o
  CC       gprs_gmm.o
  CC       gprs_gmm_fsm.o
  CC       gprs_mm_state_gb_fsm.o
  CC       gprs_sgsn.o
  CC       gprs_sm.o
  CC       gprs_sndcp.o
  CC       gprs_sndcp_comp.o
  CC       gprs_sndcp_dcomp.o
  CC       gprs_sndcp_pcomp.o
  CC       gprs_sndcp_vty.o
  CC       gprs_sndcp_xid.o
  CC       sgsn_main.o
  CC       sgsn_vty.o
sgsn_main.c: In function ‘main’:
sgsn_main.c:405:2: error: too many arguments to function ‘gprs_ns2_vty_init’
  gprs_ns2_vty_init(sgsn_nsi, &bind_address);
  ^~~~~~~~~~~~~~~~~
In file included from sgsn_main.c:44:0:
/build/deps/install/stow/libosmocore/include/osmocom/gprs/gprs_ns2.h:263:5: note: declared here
 int gprs_ns2_vty_init(struct gprs_ns2_inst *nsi);
     ^~~~~~~~~~~~~~~~~
sgsn_main.c:452:7: error: implicit declaration of function ‘gprs_ns2_vty_create’ [-Werror=implicit-function-declaration]
  rc = gprs_ns2_vty_create();
       ^~~~~~~~~~~~~~~~~~~
sgsn_main.c:458:2: error: implicit declaration of function ‘gprs_ns2_dynamic_create_nse’ [-Werror=implicit-function-declaration]
  gprs_ns2_dynamic_create_nse(sgsn_nsi, true);
  ^~~~~~~~~~~~~~~~~~~~~~~~~~~
cc1: all warnings being treated as errors
make[3]: *** [sgsn_main.o] Error 1
make[3]: *** Waiting for unfinished jobs....
Makefile:536: recipe for target 'sgsn_main.o' failed
make[3]: Leaving directory '/build/src/sgsn'
Makefile:395: recipe for target 'all-recursive' failed
make[2]: *** [all-recursive] Error 1
make[2]: Leaving directory '/build/src'
Makefile:461: recipe for target 'all-recursive' failed
make[1]: Leaving directory '/build'
make[1]: *** [all-recursive] Error 1
Makefile:393: recipe for target 'all' failed
make: *** [all] Error 2
Build step 'Execute shell' marked build as failure
[WARNINGS]Skipping publisher since build result is FAILURE
Not sending mail to unregistered user dwillmann at sysmocom.de


More information about the jenkins-notifications mailing list