Build failed in Jenkins: master-osmo-pcu » v2017.01,0,osmocom-master-debian9,lc15,True #3480

jenkins at lists.osmocom.org jenkins at lists.osmocom.org
Thu Jan 28 12:03:47 UTC 2021


See <https://jenkins.osmocom.org/jenkins/job/master-osmo-pcu/FIRMWARE_VERSION=v2017.01,WITH_MANUALS=0,label=osmocom-master-debian9,with_dsp=lc15,with_vty=True/3480/display/redirect>

Changes:


------------------------------------------
[...truncated 80.33 KB...]
+ set +x



 =============================== osmo-pcu ===============================

+ autoreconf --install --force
libtoolize: putting auxiliary files in AC_CONFIG_AUX_DIR, '.'.
libtoolize: copying file './ltmain.sh'
libtoolize: Consider adding 'AC_CONFIG_MACRO_DIRS([m4])' to configure.ac,
libtoolize: and rerunning libtoolize and aclocal.
libtoolize: Consider adding '-I m4' to ACLOCAL_AMFLAGS in Makefile.am.
configure.ac:24: installing './compile'
configure.ac:27: installing './config.guess'
configure.ac:27: installing './config.sub'
configure.ac:9: installing './install-sh'
configure.ac:9: installing './missing'
src/Makefile.am: installing './depcomp'
tests/Makefile.am:13: warning: source file 'alloc/AllocTest.cpp' is in a subdirectory,
tests/Makefile.am:13: but option 'subdir-objects' is disabled
automake: warning: possible forward-incompatibility.
automake: At least a source file is in a subdirectory, but the 'subdir-objects'
automake: automake option hasn't been enabled.  For now, the corresponding output
automake: object file(s) will be placed in the top-level directory.  However,
automake: this behaviour will change in future Automake versions: they will
automake: unconditionally cause object files to be placed in the same subdirectory
automake: of the corresponding sources.
automake: You are advised to start using 'subdir-objects' option throughout your
automake: project, to avoid future incompatibilities.
tests/Makefile.am:21: warning: source file 'alloc/MslotTest.cpp' is in a subdirectory,
tests/Makefile.am:21: but option 'subdir-objects' is disabled
tests/Makefile.am:111: warning: source file 'app_info/AppInfoTest.cpp' is in a subdirectory,
tests/Makefile.am:111: but option 'subdir-objects' is disabled
tests/Makefile.am:38: warning: source file 'bitcomp/BitcompTest.cpp' is in a subdirectory,
tests/Makefile.am:38: but option 'subdir-objects' is disabled
tests/Makefile.am:38: warning: source file '../src/egprs_rlc_compression.cpp' is in a subdirectory,
tests/Makefile.am:38: but option 'subdir-objects' is disabled
tests/Makefile.am:97: warning: source file 'codel/codel_test.c' is in a subdirectory,
tests/Makefile.am:97: but option 'subdir-objects' is disabled
tests/Makefile.am:44: warning: source file 'edge/EdgeTest.cpp' is in a subdirectory,
tests/Makefile.am:44: but option 'subdir-objects' is disabled
tests/Makefile.am:52: warning: source file 'emu/pcu_emu.cpp' is in a subdirectory,
tests/Makefile.am:52: but option 'subdir-objects' is disabled
tests/Makefile.am:52: warning: source file 'emu/test_replay_gprs_attach.cpp' is in a subdirectory,
tests/Makefile.am:52: but option 'subdir-objects' is disabled
tests/Makefile.am:52: warning: source file 'emu/openbsc_clone.c' is in a subdirectory,
tests/Makefile.am:52: but option 'subdir-objects' is disabled
tests/Makefile.am:52: warning: source file 'emu/test_pdp_activation.cpp' is in a subdirectory,
tests/Makefile.am:52: but option 'subdir-objects' is disabled
tests/Makefile.am:103: warning: source file 'fn/FnTest.cpp' is in a subdirectory,
tests/Makefile.am:103: but option 'subdir-objects' is disabled
tests/Makefile.am:81: warning: source file 'llc/LlcTest.cpp' is in a subdirectory,
tests/Makefile.am:81: but option 'subdir-objects' is disabled
tests/Makefile.am:92: warning: source file 'llist/LListTest.cpp' is in a subdirectory,
tests/Makefile.am:92: but option 'subdir-objects' is disabled
tests/Makefile.am:70: warning: source file 'ms/MsTest.cpp' is in a subdirectory,
tests/Makefile.am:70: but option 'subdir-objects' is disabled
tests/Makefile.am:7: warning: source file 'rlcmac/RLCMACTest.cpp' is in a subdirectory,
tests/Makefile.am:7: but option 'subdir-objects' is disabled
tests/Makefile.am:29: warning: source file 'tbf/TbfTest.cpp' is in a subdirectory,
tests/Makefile.am:29: but option 'subdir-objects' is disabled
tests/Makefile.am:62: warning: source file 'types/TypesTest.cpp' is in a subdirectory,
tests/Makefile.am:62: but option 'subdir-objects' is disabled
+ ./configure --enable-lc15bts-phy --with-litecell15=/build/deps/layer1-headers/inc --enable-vty-tests
checking for a BSD-compatible install... /usr/bin/install -c
checking whether build environment is sane... yes
checking for a thread-safe mkdir -p... /bin/mkdir -p
checking for gawk... gawk
checking whether make sets $(MAKE)... yes
checking whether make supports nested variables... yes
checking whether make supports nested variables... (cached) yes
checking whether make sets $(MAKE)... (cached) yes
checking for gcc... gcc
checking whether the C compiler works... yes
checking for C compiler default output file name... a.out
checking for suffix of executables... 
checking whether we are cross compiling... no
checking for suffix of object files... o
checking whether we are using the GNU C compiler... yes
checking whether gcc accepts -g... yes
checking for gcc option to accept ISO C89... none needed
checking whether gcc understands -c and -o together... yes
checking for style of include used by make... GNU
checking dependency style of gcc... gcc3
checking for g++... g++
checking whether we are using the GNU C++ compiler... yes
checking whether g++ accepts -g... yes
checking dependency style of g++... gcc3
checking build system type... x86_64-pc-linux-gnu
checking host system type... x86_64-pc-linux-gnu
checking how to print strings... printf
checking for a sed that does not truncate output... /bin/sed
checking for grep that handles long lines and -e... /bin/grep
checking for egrep... /bin/grep -E
checking for fgrep... /bin/grep -F
checking for ld used by gcc... /usr/bin/ld
checking if the linker (/usr/bin/ld) is GNU ld... yes
checking for BSD- or MS-compatible name lister (nm)... /usr/bin/nm -B
checking the name lister (/usr/bin/nm -B) interface... BSD nm
checking whether ln -s works... yes
checking the maximum length of command line arguments... 1572864
checking how to convert x86_64-pc-linux-gnu file names to x86_64-pc-linux-gnu format... func_convert_file_noop
checking how to convert x86_64-pc-linux-gnu file names to toolchain format... func_convert_file_noop
checking for /usr/bin/ld option to reload object files... -r
checking for objdump... objdump
checking how to recognize dependent libraries... pass_all
checking for dlltool... no
checking how to associate runtime and link libraries... printf %s\n
checking for ar... ar
checking for archiver @FILE support... @
checking for strip... strip
checking for ranlib... ranlib
checking command to parse /usr/bin/nm -B output from gcc object... ok
checking for sysroot... no
checking for a working dd... /bin/dd
checking how to truncate binary pipes... /bin/dd bs=4096 count=1
checking for mt... no
checking if : is a manifest tool... no
checking how to run the C preprocessor... gcc -E
checking for ANSI C header files... yes
checking for sys/types.h... yes
checking for sys/stat.h... yes
checking for stdlib.h... yes
checking for string.h... yes
checking for memory.h... yes
checking for strings.h... yes
checking for inttypes.h... yes
checking for stdint.h... yes
checking for unistd.h... yes
checking for dlfcn.h... yes
checking for objdir... .libs
checking if gcc supports -fno-rtti -fno-exceptions... no
checking for gcc option to produce PIC... -fPIC -DPIC
checking if gcc PIC flag -fPIC -DPIC works... yes
checking if gcc static flag -static works... yes
checking if gcc supports -c -o file.o... yes
checking if gcc supports -c -o file.o... (cached) yes
checking whether the gcc linker (/usr/bin/ld -m elf_x86_64) supports shared libraries... yes
checking whether -lc should be explicitly linked in... no
checking dynamic linker characteristics... GNU/Linux ld.so
checking how to hardcode library paths into programs... immediate
checking whether stripping libraries is possible... yes
checking if libtool supports shared libraries... yes
checking whether to build shared libraries... yes
checking whether to build static libraries... yes
checking how to run the C++ preprocessor... g++ -E
checking for ld used by g++... /usr/bin/ld -m elf_x86_64
checking if the linker (/usr/bin/ld -m elf_x86_64) is GNU ld... yes
checking whether the g++ linker (/usr/bin/ld -m elf_x86_64) supports shared libraries... yes
checking for g++ option to produce PIC... -fPIC -DPIC
checking if g++ PIC flag -fPIC -DPIC works... yes
checking if g++ static flag -static works... yes
checking if g++ supports -c -o file.o... yes
checking if g++ supports -c -o file.o... (cached) yes
checking whether the g++ linker (/usr/bin/ld -m elf_x86_64) supports shared libraries... yes
checking dynamic linker characteristics... (cached) GNU/Linux ld.so
checking how to hardcode library paths into programs... immediate
checking for pkg-config... /usr/bin/pkg-config
checking for pkg-config... /usr/bin/pkg-config
checking pkg-config is at least version 0.20... yes
checking for ANSI C header files... (cached) yes
checking for LIBOSMOCORE... yes
checking for LIBOSMOVTY... yes
checking for LIBOSMOGSM... yes
checking for LIBOSMOGB... yes
checking whether to enable direct DSP access for PDCH of sysmocom-bts... unset
checking whether to enable direct PHY access for PDCH of NuRAN Wireless Litecell 1.5 BTS... yes
checking whether to enable direct PHY access for PDCH of NuRAN Wireless OC-2G BTS... no
checking for python... /usr/bin/python
checking for python version... 2.7
checking for python platform... linux2
checking for python script directory... ${prefix}/lib/python2.7/dist-packages
checking for python extension module directory... ${exec_prefix}/lib/python2.7/dist-packages
checking for osmotestvty.py... yes
checking whether to enable VTY tests... yes
CPPFLAGS=""
CFLAGS=" -std=gnu11"
CXXFLAGS=" -std=gnu++03"
LDFLAGS=""
checking that generated files are newer than configure... done
configure: creating ./config.status
config.status: creating include/Makefile
config.status: creating src/Makefile
config.status: creating doc/Makefile
config.status: creating doc/examples/Makefile
config.status: creating tests/Makefile
config.status: creating doc/manuals/Makefile
config.status: creating contrib/Makefile
config.status: creating contrib/systemd/Makefile
config.status: creating contrib/osmo-pcu.spec
config.status: creating Makefile
config.status: executing tests/atconfig commands
config.status: executing depfiles commands
config.status: executing libtool commands
+ make -j 4
Making all in include
make[1]: Entering directory '/build/include'
make[1]: Nothing to be done for 'all'.
make[1]: Leaving directory '/build/include'
Making all in src
make[1]: Entering directory '/build/src'
  CXX      gprs_debug.lo
  CC       gsm_rlcmac.lo
  CC       csn1.lo
  CC       gprs_bssgp_pcu.lo
gprs_bssgp_pcu.c: In function ‘gprs_ns_prim_status_cb’:
gprs_bssgp_pcu.c:579:7: error: ‘NS_AFF_CAUSE_SNS_CONFIGURED’ undeclared (first use in this function)
  case NS_AFF_CAUSE_SNS_CONFIGURED:
       ^~~~~~~~~~~~~~~~~~~~~~~~~~~
gprs_bssgp_pcu.c:579:7: note: each undeclared identifier is reported only once for each function it appears in
gprs_bssgp_pcu.c:582:7: error: ‘NS_AFF_CAUSE_RECOVERY’ undeclared (first use in this function)
  case NS_AFF_CAUSE_RECOVERY:
       ^~~~~~~~~~~~~~~~~~~~~
gprs_bssgp_pcu.c:591:7: error: ‘NS_AFF_CAUSE_FAILURE’ undeclared (first use in this function)
  case NS_AFF_CAUSE_FAILURE:
       ^~~~~~~~~~~~~~~~~~~~
gprs_bssgp_pcu.c:601:7: error: ‘NS_AFF_CAUSE_SNS_FAILURE’ undeclared (first use in this function)
  case NS_AFF_CAUSE_SNS_FAILURE:
       ^~~~~~~~~~~~~~~~~~~~~~~~
gprs_bssgp_pcu.c: In function ‘gprs_ns_prim_cb’:
gprs_bssgp_pcu.c:631:7: error: ‘PRIM_NS_UNIT_DATA’ undeclared (first use in this function)
  case PRIM_NS_UNIT_DATA:
       ^~~~~~~~~~~~~~~~~
gprs_bssgp_pcu.c:639:7: error: ‘PRIM_NS_STATUS’ undeclared (first use in this function)
  case PRIM_NS_STATUS:
       ^~~~~~~~~~~~~~
gprs_bssgp_pcu.c:642:7: error: ‘PRIM_NS_CONGESTION’ undeclared (first use in this function)
  case PRIM_NS_CONGESTION:
       ^~~~~~~~~~~~~~~~~~
gprs_bssgp_pcu.c: In function ‘gprs_gp_send_cb’:
gprs_bssgp_pcu.c:666:35: error: ‘PRIM_NS_UNIT_DATA’ undeclared (first use in this function)
  osmo_prim_init(&nsp.oph, SAP_NS, PRIM_NS_UNIT_DATA,
                                   ^~~~~~~~~~~~~~~~~
gprs_bssgp_pcu.c: In function ‘ns_create_nsvc’:
gprs_bssgp_pcu.c:1032:34: error: ‘NS2_DIALECT_SNS’ undeclared (first use in this function)
   if (the_pcu->vty.ns_dialect == NS2_DIALECT_SNS) {
                                  ^~~~~~~~~~~~~~~
gprs_bssgp_pcu.c: In function ‘gprs_ns_config’:
gprs_bssgp_pcu.c:1102:40: error: ‘NS2_DIALECT_SNS’ undeclared (first use in this function)
  } else if (the_pcu->vty.ns_dialect == NS2_DIALECT_SNS) {
                                        ^~~~~~~~~~~~~~~
Makefile:776: recipe for target 'gprs_bssgp_pcu.lo' failed
make[1]: *** [gprs_bssgp_pcu.lo] Error 1
make[1]: *** Waiting for unfinished jobs....
make[1]: Leaving directory '/build/src'
Makefile:417: recipe for target 'all-recursive' failed
make: *** [all-recursive] Error 1
Build step 'Execute shell' marked build as failure
[WARNINGS]Skipping publisher since build result is FAILURE


More information about the jenkins-notifications mailing list