Build failed in Jenkins: master-osmo-msc » --disable-iu,1,a3=default,a4=default,osmocom-master-debian9 #25985

jenkins at lists.osmocom.org jenkins at lists.osmocom.org
Wed Aug 18 00:00:19 UTC 2021


See <https://jenkins.osmocom.org/jenkins/job/master-osmo-msc/IU=--disable-iu,WITH_MANUALS=1,a3=default,a4=default,label=osmocom-master-debian9/25985/display/redirect>

Changes:


------------------------------------------
[...truncated 429.36 KB...]
  1: smpp                                            ok
  2: sms_queue_test                                  ok
  3: db_sms_test                                     ok
  4: msc_vlr_test_no_authen                          ok
  5: msc_vlr_test_gsm_authen                         ok
  6: msc_vlr_test_gsm_ciph                           ok
  7: msc_vlr_test_umts_authen                        ok
  8: msc_vlr_test_authen_reuse                       ok
  9: msc_vlr_test_hlr_reject                         ok
 10: msc_vlr_test_hlr_timeout                        ok
 11: msc_vlr_test_ms_timeout                         ok
 12: msc_vlr_test_reject_concurrency                 ok
 13: msc_vlr_test_call                               ok
 14: msc_vlr_test_rest                               ok
 15: msc_vlr_test_ss                                 ok
 16: sdp_msg_test                                    ok
 17: mncc_test                                       ok

## ------------- ##
## Test results. ##
## ------------- ##

All 17 tests were successful.
make  python-tests
make[5]: Entering directory '/build/tests'
make vty-test
make[6]: Entering directory '/build/tests'
make vty-python-test
make[7]: Entering directory '/build/tests'
IU=0 osmotestvty.py -p /build -w /build -v
test_history (__main__.TestVTY) ... confpath /build, workdir /build
Running tests for specific VTY commands
Launch: ./src/osmo-msc/osmo-msc -c /build/doc/examples/osmo-msc/osmo-msc.cfg from /build
Opening /dev/null
Launching: PWD=/build './src/osmo-msc/osmo-msc' '-c' '/build/doc/examples/osmo-msc/osmo-msc.cfg'

> ls -l /proc/27736/fd
total 0
lr-x------ 1 build build 64 Aug 18 00:00 0 -> pipe:[461838623]
l-wx------ 1 build build 64 Aug 18 00:00 1 -> pipe:[461838624]
l-wx------ 1 build build 64 Aug 18 00:00 2 -> pipe:[461838625]
l-wx------ 1 build build 64 Aug 18 00:00 3 -> /dev/null


> ss -tn
State      Recv-Q Send-Q Local Address:Port               Peer Address:Port              


> ss -tln
State      Recv-Q Send-Q Local Address:Port               Peer Address:Port              
LISTEN     0      10     127.0.0.1:4254                     *:*                  
LISTEN     0      10     127.0.0.1:4255                     *:*                  
LISTEN     0      10           *:2775                     *:*                  


> ps xua | grep osmo
build    27736  0.0  0.0  53724 20692 ?        S    00:00   0:00 /usr/bin/python3 /usr/local/bin/osmotestvty.py -p /build -w /build -v
build    27737  0.0  0.0 21474989440 26100 ?   D    00:00   0:00 ./src/osmo-msc/osmo-msc -c /build/doc/examples/osmo-msc/osmo-msc.cfg
build    27744  0.0  0.0   4280   712 ?        S    00:00   0:00 /bin/sh -c ps xua | grep osmo
build    27746  0.0  0.0   4280    88 ?        R    00:00   0:00 /bin/sh -c ps xua | grep osmo

ok
test_terminal_length (__main__.TestVTY) ... Socket: in 1 tries, connected to 127.0.0.1:4254 <socket.socket fd=4, family=AddressFamily.AF_INET, type=SocketKind.SOCK_STREAM, proto=0, laddr=('127.0.0.1', 60232), raddr=('127.0.0.1', 4254)> (1 sockets open)
Socket: closing 127.0.0.1:4254 <socket.socket fd=4, family=AddressFamily.AF_INET, type=SocketKind.SOCK_STREAM, proto=0, laddr=('127.0.0.1', 60232), raddr=('127.0.0.1', 4254)> (0 sockets open)
Terminating took 0.897s
Launch: ./src/osmo-msc/osmo-msc -c /build/doc/examples/osmo-msc/osmo-msc.cfg from /build
Launching: PWD=/build './src/osmo-msc/osmo-msc' '-c' '/build/doc/examples/osmo-msc/osmo-msc.cfg'

> ls -l /proc/27736/fd
total 0
lr-x------ 1 build build 64 Aug 18 00:00 0 -> pipe:[461838623]
l-wx------ 1 build build 64 Aug 18 00:00 1 -> pipe:[461838624]
l-wx------ 1 build build 64 Aug 18 00:00 2 -> pipe:[461838625]
l-wx------ 1 build build 64 Aug 18 00:00 3 -> /dev/null


> ss -tn
State      Recv-Q Send-Q Local Address:Port               Peer Address:Port              


> ss -tln
State      Recv-Q Send-Q Local Address:Port               Peer Address:Port              


> ps xua | grep osmo
build    27736  7.5  0.0  53724 20780 ?        S    00:00   0:00 /usr/bin/python3 /usr/local/bin/osmotestvty.py -p /build -w /build -v
build    27748  0.0  0.0 21474989440 26388 ?   D    00:00   0:00 ./src/osmo-msc/osmo-msc -c /build/doc/examples/osmo-msc/osmo-msc.cfg
build    27755  0.0  0.0   4280   740 ?        S    00:00   0:00 /bin/sh -c ps xua | grep osmo
build    27757  0.0  0.0   4280    84 ?        R    00:00   0:00 /bin/sh -c ps xua | grep osmo

ok
test_unknown_command (__main__.TestVTY) ... Socket: in 1 tries, connected to 127.0.0.1:4254 <socket.socket fd=4, family=AddressFamily.AF_INET, type=SocketKind.SOCK_STREAM, proto=0, laddr=('127.0.0.1', 60234), raddr=('127.0.0.1', 4254)> (1 sockets open)
Socket: closing 127.0.0.1:4254 <socket.socket fd=4, family=AddressFamily.AF_INET, type=SocketKind.SOCK_STREAM, proto=0, laddr=('127.0.0.1', 60234), raddr=('127.0.0.1', 4254)> (0 sockets open)
Launch: ./src/osmo-msc/osmo-msc -c /build/doc/examples/osmo-msc/osmo-msc.cfg from /build
Launching: PWD=/build './src/osmo-msc/osmo-msc' '-c' '/build/doc/examples/osmo-msc/osmo-msc.cfg'

> ls -l /proc/27736/fd
total 0
lr-x------ 1 build build 64 Aug 18 00:00 0 -> pipe:[461838623]
l-wx------ 1 build build 64 Aug 18 00:00 1 -> pipe:[461838624]
l-wx------ 1 build build 64 Aug 18 00:00 2 -> pipe:[461838625]
l-wx------ 1 build build 64 Aug 18 00:00 3 -> /dev/null


> ss -tn
State      Recv-Q Send-Q Local Address:Port               Peer Address:Port              


> ss -tln
State      Recv-Q Send-Q Local Address:Port               Peer Address:Port              


> ps xua | grep osmo
build    27736  7.5  0.0  53724 20780 ?        S    00:00   0:00 /usr/bin/python3 /usr/local/bin/osmotestvty.py -p /build -w /build -v
build    27759  0.0  0.0 21474989440 26264 ?   D    00:00   0:00 ./src/osmo-msc/osmo-msc -c /build/doc/examples/osmo-msc/osmo-msc.cfg
build    27766  0.0  0.0   4280   772 ?        S    00:00   0:00 /bin/sh -c ps xua | grep osmo
build    27768  0.0  0.0  12784  1012 ?        S    00:00   0:00 grep osmo

ok

----------------------------------------------------------------------
Ran 3 tests in 3.346s

OK
Socket: in 1 tries, connected to 127.0.0.1:4254 <socket.socket fd=4, family=AddressFamily.AF_INET, type=SocketKind.SOCK_STREAM, proto=0, laddr=('127.0.0.1', 60236), raddr=('127.0.0.1', 4254)> (1 sockets open)
Socket: closing 127.0.0.1:4254 <socket.socket fd=4, family=AddressFamily.AF_INET, type=SocketKind.SOCK_STREAM, proto=0, laddr=('127.0.0.1', 60236), raddr=('127.0.0.1', 4254)> (0 sockets open)
Terminating took 0.897s
IU=0 osmotestconfig.py -p /build -w /build -v
Verifying src/osmo-msc/osmo-msc -c /build/doc/examples/osmo-msc/osmo-msc.cfg, test verify_doc
Opening /dev/null
Launching: PWD=/build 'src/osmo-msc/osmo-msc' '-c' '/build/doc/examples/osmo-msc/osmo-msc.cfg'

> ls -l /proc/27770/fd
total 0
lr-x------ 1 build build 64 Aug 18 00:00 0 -> pipe:[461838623]
l-wx------ 1 build build 64 Aug 18 00:00 1 -> pipe:[461838624]
l-wx------ 1 build build 64 Aug 18 00:00 2 -> pipe:[461838625]
l-wx------ 1 build build 64 Aug 18 00:00 3 -> /dev/null
Warning: doc/examples/osmo-msc/osmo-msc_custom-sccp.cfg is not being tested
Warning: doc/examples/osmo-msc/osmo-msc_multi-cs7.cfg is not being tested


> ss -tn
State      Recv-Q Send-Q Local Address:Port               Peer Address:Port              


> ss -tln
State      Recv-Q Send-Q Local Address:Port               Peer Address:Port              
LISTEN     0      10     127.0.0.1:4254                     *:*                  
LISTEN     0      10     127.0.0.1:4255                     *:*                  
LISTEN     0      10           *:2775                     *:*                  


> ps xua | grep osmo
build    27770  0.0  0.0  53776 20936 ?        S    00:00   0:00 /usr/bin/python3 /usr/local/bin/osmotestconfig.py -p /build -w /build -v
build    27771  0.0  0.0 21474989440 26272 ?   D    00:00   0:00 src/osmo-msc/osmo-msc -c /build/doc/examples/osmo-msc/osmo-msc.cfg
build    27778  0.0  0.0   4280   704 ?        S    00:00   0:00 /bin/sh -c ps xua | grep osmo
build    27780  0.0  0.0  10980   992 ?        R    00:00   0:00 grep osmo

Socket: in 1 tries, connected to 127.0.0.1:4254 <socket.socket fd=4, family=AddressFamily.AF_INET, type=SocketKind.SOCK_STREAM, proto=0, laddr=('127.0.0.1', 60240), raddr=('127.0.0.1', 4254)> (1 sockets open)
Terminating took 0.897s
Socket: closing 127.0.0.1:4254 <socket.socket fd=4, family=AddressFamily.AF_INET, type=SocketKind.SOCK_STREAM, proto=0, laddr=('127.0.0.1', 60240), raddr=('127.0.0.1', 4254)> (0 sockets open)
Verifying src/osmo-msc/osmo-msc -c /build/writtenconfig/osmo-msc.cfgq4ga_moi, test write_config
Launching: PWD=/build 'src/osmo-msc/osmo-msc' '-c' '/build/writtenconfig/osmo-msc.cfgq4ga_moi'

> ls -l /proc/27770/fd
total 0
lr-x------ 1 build build 64 Aug 18 00:00 0 -> pipe:[461838623]
l-wx------ 1 build build 64 Aug 18 00:00 1 -> pipe:[461838624]
l-wx------ 1 build build 64 Aug 18 00:00 2 -> pipe:[461838625]
l-wx------ 1 build build 64 Aug 18 00:00 3 -> /dev/null
Documentation error (missing docs): 
<command id='no mgw reset-endpoint NAME'>
        <param name='NAME' doc='(null)' />



> ss -tn
State      Recv-Q Send-Q Local Address:Port               Peer Address:Port              


> ss -tln
State      Recv-Q Send-Q Local Address:Port               Peer Address:Port              


> ps xua | grep osmo
build    27770 16.0  0.0  54224 21460 ?        S    00:00   0:00 /usr/bin/python3 /usr/local/bin/osmotestconfig.py -p /build -w /build -v
build    27782  0.0  0.0 21474989064 24692 ?   R    00:00   0:00 src/osmo-msc/osmo-msc -c /build/writtenconfig/osmo-msc.cfgq4ga_moi
build    27789  0.0  0.0   4280   700 ?        S    00:00   0:00 /bin/sh -c ps xua | grep osmo
build    27791  0.0  0.0  12784  1028 ?        S    00:00   0:00 grep osmo

Socket: in 1 tries, connected to 127.0.0.1:4254 <socket.socket fd=4, family=AddressFamily.AF_INET, type=SocketKind.SOCK_STREAM, proto=0, laddr=('127.0.0.1', 60242), raddr=('127.0.0.1', 4254)> (1 sockets open)
Terminating took 0.475s
Socket: closing 127.0.0.1:4254 <socket.socket fd=4, family=AddressFamily.AF_INET, type=SocketKind.SOCK_STREAM, proto=0, laddr=('127.0.0.1', 60242), raddr=('127.0.0.1', 4254)> (0 sockets open)
Verifying src/osmo-msc/osmo-msc -c /build/writtenconfig/osmo-msc.cfgq4ga_moi, test token_vty_command
Launching: PWD=/build 'src/osmo-msc/osmo-msc' '-c' '/build/writtenconfig/osmo-msc.cfgq4ga_moi'

> ls -l /proc/27770/fd
total 0
lr-x------ 1 build build 64 Aug 18 00:00 0 -> pipe:[461838623]
l-wx------ 1 build build 64 Aug 18 00:00 1 -> pipe:[461838624]
l-wx------ 1 build build 64 Aug 18 00:00 2 -> pipe:[461838625]
l-wx------ 1 build build 64 Aug 18 00:00 3 -> /dev/null


> ss -tn
State      Recv-Q Send-Q Local Address:Port               Peer Address:Port              


> ss -tln
State      Recv-Q Send-Q Local Address:Port               Peer Address:Port              


> ps xua | grep osmo
build    27770  5.3  0.0  54224 21460 ?        S    00:00   0:00 /usr/bin/python3 /usr/local/bin/osmotestconfig.py -p /build -w /build -v
build    27793  0.0  0.0 21474989440 26572 ?   D    00:00   0:00 src/osmo-msc/osmo-msc -c /build/writtenconfig/osmo-msc.cfgq4ga_moi
build    27800  0.0  0.0   4280   736 ?        S    00:00   0:00 /bin/sh -c ps xua | grep osmo
build    27802  0.0  0.0  12784   940 ?        S    00:00   0:00 grep osmo

Socket: in 1 tries, connected to 127.0.0.1:4254 <socket.socket fd=4, family=AddressFamily.AF_INET, type=SocketKind.SOCK_STREAM, proto=0, laddr=('127.0.0.1', 60250), raddr=('127.0.0.1', 4254)> (1 sockets open)
Terminating took 0.897s
Socket: closing 127.0.0.1:4254 <socket.socket fd=4, family=AddressFamily.AF_INET, type=SocketKind.SOCK_STREAM, proto=0, laddr=('127.0.0.1', 60250), raddr=('127.0.0.1', 4254)> (0 sockets open)
ERRORS: 1
make[7]: *** [vty-python-test] Error 1
Makefile:720: recipe for target 'vty-python-test' failed
make[7]: Leaving directory '/build/tests'
Makefile:740: recipe for target 'vty-test' failed
make[6]: *** [vty-test] Error 2
make[6]: Leaving directory '/build/tests'
Makefile:710: recipe for target 'python-tests' failed
make[5]: *** [python-tests] Error 2
make[5]: Leaving directory '/build/tests'
Makefile:763: recipe for target 'check-local' failed
make[4]: *** [check-local] Error 2
make[4]: Leaving directory '/build/tests'
make[3]: *** [check-am] Error 2
Makefile:569: recipe for target 'check-am' failed
make[3]: Leaving directory '/build/tests'
make[2]: *** [check-recursive] Error 1
Makefile:421: recipe for target 'check-recursive' failed
make[2]: Leaving directory '/build/tests'
Makefile:469: recipe for target 'check-recursive' failed
make[1]: Leaving directory '/build'
make[1]: *** [check-recursive] Error 1
Makefile:760: recipe for target 'check' failed
make: *** [check] Error 2
+ cat-testlogs.sh
Build step 'Execute shell' marked build as failure
[WARNINGS]Skipping publisher since build result is FAILURE


More information about the jenkins-notifications mailing list