Build failed in Jenkins: master-osmo-msc » --enable-iu,0,a3=default,a4=default,osmocom-master-debian9 #25983

jenkins at lists.osmocom.org jenkins at lists.osmocom.org
Tue Aug 17 16:18:04 UTC 2021


See <https://jenkins.osmocom.org/jenkins/job/master-osmo-msc/IU=--enable-iu,WITH_MANUALS=0,a3=default,a4=default,label=osmocom-master-debian9/25983/display/redirect>

Changes:


------------------------------------------
[...truncated 801.01 KB...]
> ss -tln
State      Recv-Q Send-Q Local Address:Port               Peer Address:Port              


> ps xua | grep osmo
build     9327  8.5  0.0  54348 21484 ?        S    16:17   0:00 /usr/bin/python3 /usr/local/bin/osmotestconfig.py -p /build -w /build -v
build     9339  0.0  0.0 21474995340 27244 ?   D    16:17   0:00 src/osmo-msc/osmo-msc -c /build/writtenconfig/osmo-msc.cfgednxe0vb
build     9346  0.0  0.0   4280   720 ?        S    16:17   0:00 /bin/sh -c ps xua | grep osmo
build     9348  0.0  0.0  12784   912 ?        S    16:17   0:00 grep osmo

Socket: in 1 tries, connected to 127.0.0.1:4254 <socket.socket fd=4, family=AddressFamily.AF_INET, type=SocketKind.SOCK_STREAM, proto=0, laddr=('127.0.0.1', 58362), raddr=('127.0.0.1', 4254)> (1 sockets open)
Terminating took 0.475s
Socket: closing 127.0.0.1:4254 <socket.socket fd=4, family=AddressFamily.AF_INET, type=SocketKind.SOCK_STREAM, proto=0, laddr=('127.0.0.1', 58362), raddr=('127.0.0.1', 4254)> (0 sockets open)
Verifying src/osmo-msc/osmo-msc -c /build/writtenconfig/osmo-msc.cfgednxe0vb, test token_vty_command
Launching: PWD=/build 'src/osmo-msc/osmo-msc' '-c' '/build/writtenconfig/osmo-msc.cfgednxe0vb'

> ls -l /proc/9327/fd
total 0
lr-x------ 1 build build 64 Aug 17 16:17 0 -> pipe:[459313566]
l-wx------ 1 build build 64 Aug 17 16:17 1 -> pipe:[459313567]
l-wx------ 1 build build 64 Aug 17 16:17 2 -> pipe:[459313568]
l-wx------ 1 build build 64 Aug 17 16:17 3 -> /dev/null


> ss -tn
State      Recv-Q Send-Q Local Address:Port               Peer Address:Port              


> ss -tln
State      Recv-Q Send-Q Local Address:Port               Peer Address:Port              


> ps xua | grep osmo
build     9327  5.6  0.0  54348 21484 ?        S    16:17   0:00 /usr/bin/python3 /usr/local/bin/osmotestconfig.py -p /build -w /build -v
build     9350  0.0  0.0 21474989712 23244 ?   R    16:17   0:00 src/osmo-msc/osmo-msc -c /build/writtenconfig/osmo-msc.cfgednxe0vb
build     9357  0.0  0.0   4280   744 ?        S    16:17   0:00 /bin/sh -c ps xua | grep osmo
build     9359  0.0  0.0  12784   944 ?        S    16:17   0:00 grep osmo

Connecting socket failed, retrying...
Socket: in 2 tries, connected to 127.0.0.1:4254 <socket.socket fd=5, family=AddressFamily.AF_INET, type=SocketKind.SOCK_STREAM, proto=0, laddr=('127.0.0.1', 58370), raddr=('127.0.0.1', 4254)> (1 sockets open)
Terminating took 0.897s
Socket: closing 127.0.0.1:4254 <socket.socket fd=5, family=AddressFamily.AF_INET, type=SocketKind.SOCK_STREAM, proto=0, laddr=('127.0.0.1', 58370), raddr=('127.0.0.1', 4254)> (0 sockets open)
Verifying src/osmo-msc/osmo-msc -c /build/doc/examples/osmo-msc/osmo-msc_custom-sccp.cfg, test verify_doc
Launching: PWD=/build 'src/osmo-msc/osmo-msc' '-c' '/build/doc/examples/osmo-msc/osmo-msc_custom-sccp.cfg'

> ls -l /proc/9327/fd
total 0
lr-x------ 1 build build 64 Aug 17 16:17 0 -> pipe:[459313566]
l-wx------ 1 build build 64 Aug 17 16:17 1 -> pipe:[459313567]
l-wx------ 1 build build 64 Aug 17 16:17 2 -> pipe:[459313568]
l-wx------ 1 build build 64 Aug 17 16:17 3 -> /dev/null


> ss -tn
State      Recv-Q Send-Q Local Address:Port               Peer Address:Port              


> ss -tln
State      Recv-Q Send-Q Local Address:Port               Peer Address:Port              


> ps xua | grep osmo
build     9327  3.6  0.0  54348 21484 ?        S    16:17   0:00 /usr/bin/python3 /usr/local/bin/osmotestconfig.py -p /build -w /build -v
build     9361  0.0  0.0 21474995340 27512 ?   D    16:17   0:00 src/osmo-msc/osmo-msc -c /build/doc/examples/osmo-msc/osmo-msc_custom-sccp.cfg
build     9368  0.0  0.0   4280   716 ?        S    16:17   0:00 /bin/sh -c ps xua | grep osmo
build     9370  0.0  0.0  12784   932 ?        S    16:17   0:00 grep osmo

Socket: in 1 tries, connected to 127.0.0.1:4254 <socket.socket fd=4, family=AddressFamily.AF_INET, type=SocketKind.SOCK_STREAM, proto=0, laddr=('127.0.0.1', 58376), raddr=('127.0.0.1', 4254)> (1 sockets open)
Terminating took 0.897s
Socket: closing 127.0.0.1:4254 <socket.socket fd=4, family=AddressFamily.AF_INET, type=SocketKind.SOCK_STREAM, proto=0, laddr=('127.0.0.1', 58376), raddr=('127.0.0.1', 4254)> (0 sockets open)
Verifying src/osmo-msc/osmo-msc -c /build/writtenconfig/osmo-msc_custom-sccp.cfgi7vr3p6l, test write_config
Launching: PWD=/build 'src/osmo-msc/osmo-msc' '-c' '/build/writtenconfig/osmo-msc_custom-sccp.cfgi7vr3p6l'

> ls -l /proc/9327/fd
total 0
lr-x------ 1 build build 64 Aug 17 16:17 0 -> pipe:[459313566]
l-wx------ 1 build build 64 Aug 17 16:17 1 -> pipe:[459313567]
l-wx------ 1 build build 64 Aug 17 16:17 2 -> pipe:[459313568]
l-wx------ 1 build build 64 Aug 17 16:17 3 -> /dev/null
Documentation error (missing docs): 
<command id='no mgw reset-endpoint NAME'>
        <param name='NAME' doc='(null)' />



> ss -tn
State      Recv-Q Send-Q Local Address:Port               Peer Address:Port              


> ss -tln
State      Recv-Q Send-Q Local Address:Port               Peer Address:Port              


> ps xua | grep osmo
build     9327  2.8  0.0  54348 21508 ?        S    16:17   0:00 /usr/bin/python3 /usr/local/bin/osmotestconfig.py -p /build -w /build -v
build     9372  0.0  0.0 21474989712 23552 ?   R    16:17   0:00 src/osmo-msc/osmo-msc -c /build/writtenconfig/osmo-msc_custom-sccp.cfgi7vr3p6l
build     9379  0.0  0.0   4280   748 ?        S    16:17   0:00 /bin/sh -c ps xua | grep osmo
build     9381  0.0  0.0  12784   992 ?        S    16:17   0:00 grep osmo

Connecting socket failed, retrying...
Socket: in 2 tries, connected to 127.0.0.1:4254 <socket.socket fd=5, family=AddressFamily.AF_INET, type=SocketKind.SOCK_STREAM, proto=0, laddr=('127.0.0.1', 58386), raddr=('127.0.0.1', 4254)> (1 sockets open)
Terminating took 0.897s
Socket: closing 127.0.0.1:4254 <socket.socket fd=5, family=AddressFamily.AF_INET, type=SocketKind.SOCK_STREAM, proto=0, laddr=('127.0.0.1', 58386), raddr=('127.0.0.1', 4254)> (0 sockets open)
Verifying src/osmo-msc/osmo-msc -c /build/writtenconfig/osmo-msc_custom-sccp.cfgi7vr3p6l, test token_vty_command
Launching: PWD=/build 'src/osmo-msc/osmo-msc' '-c' '/build/writtenconfig/osmo-msc_custom-sccp.cfgi7vr3p6l'

> ls -l /proc/9327/fd
total 0
lr-x------ 1 build build 64 Aug 17 16:17 0 -> pipe:[459313566]
l-wx------ 1 build build 64 Aug 17 16:17 1 -> pipe:[459313567]
l-wx------ 1 build build 64 Aug 17 16:17 2 -> pipe:[459313568]
l-wx------ 1 build build 64 Aug 17 16:17 3 -> /dev/null


> ss -tn
State      Recv-Q Send-Q Local Address:Port               Peer Address:Port              


> ss -tln
State      Recv-Q Send-Q Local Address:Port               Peer Address:Port              


> ps xua | grep osmo
build     9327  2.2  0.0  54348 21508 ?        S    16:17   0:00 /usr/bin/python3 /usr/local/bin/osmotestconfig.py -p /build -w /build -v
build     9383  0.0  0.0 21474989712 25420 ?   R    16:17   0:00 src/osmo-msc/osmo-msc -c /build/writtenconfig/osmo-msc_custom-sccp.cfgi7vr3p6l
build     9390  0.0  0.0   4280   700 ?        S    16:17   0:00 /bin/sh -c ps xua | grep osmo
build     9392  0.0  0.0  12784   940 ?        S    16:17   0:00 grep osmo

Connecting socket failed, retrying...
Socket: in 2 tries, connected to 127.0.0.1:4254 <socket.socket fd=5, family=AddressFamily.AF_INET, type=SocketKind.SOCK_STREAM, proto=0, laddr=('127.0.0.1', 58390), raddr=('127.0.0.1', 4254)> (1 sockets open)
Terminating took 0.897s
Socket: closing 127.0.0.1:4254 <socket.socket fd=5, family=AddressFamily.AF_INET, type=SocketKind.SOCK_STREAM, proto=0, laddr=('127.0.0.1', 58390), raddr=('127.0.0.1', 4254)> (0 sockets open)
Verifying src/osmo-msc/osmo-msc -c /build/doc/examples/osmo-msc/osmo-msc_multi-cs7.cfg, test verify_doc
Launching: PWD=/build 'src/osmo-msc/osmo-msc' '-c' '/build/doc/examples/osmo-msc/osmo-msc_multi-cs7.cfg'

> ls -l /proc/9327/fd
total 0
lr-x------ 1 build build 64 Aug 17 16:17 0 -> pipe:[459313566]
l-wx------ 1 build build 64 Aug 17 16:17 1 -> pipe:[459313567]
l-wx------ 1 build build 64 Aug 17 16:17 2 -> pipe:[459313568]
l-wx------ 1 build build 64 Aug 17 16:17 3 -> /dev/null


> ss -tn
State      Recv-Q Send-Q Local Address:Port               Peer Address:Port              


> ss -tln
State      Recv-Q Send-Q Local Address:Port               Peer Address:Port              


> ps xua | grep osmo
build     9327  2.0  0.0  54348 21508 ?        S    16:17   0:00 /usr/bin/python3 /usr/local/bin/osmotestconfig.py -p /build -w /build -v
build     9394  0.0  0.0 21474995340 27636 ?   D    16:17   0:00 src/osmo-msc/osmo-msc -c /build/doc/examples/osmo-msc/osmo-msc_multi-cs7.cfg
build     9401  0.0  0.0   4280   720 ?        S    16:17   0:00 /bin/sh -c ps xua | grep osmo
build     9403  0.0  0.0  12784   972 ?        S    16:17   0:00 grep osmo

Socket: in 1 tries, connected to 127.0.0.1:4254 <socket.socket fd=4, family=AddressFamily.AF_INET, type=SocketKind.SOCK_STREAM, proto=0, laddr=('127.0.0.1', 58394), raddr=('127.0.0.1', 4254)> (1 sockets open)
Terminating took 0.897s
Socket: closing 127.0.0.1:4254 <socket.socket fd=4, family=AddressFamily.AF_INET, type=SocketKind.SOCK_STREAM, proto=0, laddr=('127.0.0.1', 58394), raddr=('127.0.0.1', 4254)> (0 sockets open)
Verifying src/osmo-msc/osmo-msc -c /build/writtenconfig/osmo-msc_multi-cs7.cfggkm566j5, test write_config
Launching: PWD=/build 'src/osmo-msc/osmo-msc' '-c' '/build/writtenconfig/osmo-msc_multi-cs7.cfggkm566j5'

> ls -l /proc/9327/fd
total 0
lr-x------ 1 build build 64 Aug 17 16:17 0 -> pipe:[459313566]
l-wx------ 1 build build 64 Aug 17 16:17 1 -> pipe:[459313567]
l-wx------ 1 build build 64 Aug 17 16:17 2 -> pipe:[459313568]
l-wx------ 1 build build 64 Aug 17 16:17 3 -> /dev/null
Documentation error (missing docs): 
<command id='no mgw reset-endpoint NAME'>
        <param name='NAME' doc='(null)' />



> ss -tn
State      Recv-Q Send-Q Local Address:Port               Peer Address:Port              


> ss -tln
State      Recv-Q Send-Q Local Address:Port               Peer Address:Port              


> ps xua | grep osmo
build     9327  1.7  0.0  54348 21508 ?        S    16:17   0:00 /usr/bin/python3 /usr/local/bin/osmotestconfig.py -p /build -w /build -v
build     9405  0.0  0.0 21474989712 24928 ?   R    16:18   0:00 src/osmo-msc/osmo-msc -c /build/writtenconfig/osmo-msc_multi-cs7.cfggkm566j5
build     9412  0.0  0.0   4280   704 ?        S    16:18   0:00 /bin/sh -c ps xua | grep osmo
build     9414  0.0  0.0  12784  1016 ?        S    16:18   0:00 grep osmo

Connecting socket failed, retrying...
Socket: in 2 tries, connected to 127.0.0.1:4254 <socket.socket fd=5, family=AddressFamily.AF_INET, type=SocketKind.SOCK_STREAM, proto=0, laddr=('127.0.0.1', 58398), raddr=('127.0.0.1', 4254)> (1 sockets open)
Terminating took 0.475s
Socket: closing 127.0.0.1:4254 <socket.socket fd=5, family=AddressFamily.AF_INET, type=SocketKind.SOCK_STREAM, proto=0, laddr=('127.0.0.1', 58398), raddr=('127.0.0.1', 4254)> (0 sockets open)
Verifying src/osmo-msc/osmo-msc -c /build/writtenconfig/osmo-msc_multi-cs7.cfggkm566j5, test token_vty_command
Launching: PWD=/build 'src/osmo-msc/osmo-msc' '-c' '/build/writtenconfig/osmo-msc_multi-cs7.cfggkm566j5'

> ls -l /proc/9327/fd
total 0
lr-x------ 1 build build 64 Aug 17 16:17 0 -> pipe:[459313566]
l-wx------ 1 build build 64 Aug 17 16:17 1 -> pipe:[459313567]
l-wx------ 1 build build 64 Aug 17 16:17 2 -> pipe:[459313568]
l-wx------ 1 build build 64 Aug 17 16:17 3 -> /dev/null


> ss -tn
State      Recv-Q Send-Q Local Address:Port               Peer Address:Port              


> ss -tln
State      Recv-Q Send-Q Local Address:Port               Peer Address:Port              


> ps xua | grep osmo
build     9327  1.6  0.0  54348 21508 ?        S    16:17   0:00 /usr/bin/python3 /usr/local/bin/osmotestconfig.py -p /build -w /build -v
build     9416  0.0  0.0 21474989712 24188 ?   R    16:18   0:00 src/osmo-msc/osmo-msc -c /build/writtenconfig/osmo-msc_multi-cs7.cfggkm566j5
build     9423  0.0  0.0   4280   744 ?        S    16:18   0:00 /bin/sh -c ps xua | grep osmo
build     9425  0.0  0.0  12784   968 ?        S    16:18   0:00 grep osmo

ERRORS: 3
Connecting socket failed, retrying...
Socket: in 2 tries, connected to 127.0.0.1:4254 <socket.socket fd=5, family=AddressFamily.AF_INET, type=SocketKind.SOCK_STREAM, proto=0, laddr=('127.0.0.1', 58402), raddr=('127.0.0.1', 4254)> (1 sockets open)
Terminating took 0.897s
Socket: closing 127.0.0.1:4254 <socket.socket fd=5, family=AddressFamily.AF_INET, type=SocketKind.SOCK_STREAM, proto=0, laddr=('127.0.0.1', 58402), raddr=('127.0.0.1', 4254)> (0 sockets open)
make[7]: *** [vty-python-test] Error 3
Makefile:718: recipe for target 'vty-python-test' failed
make[7]: Leaving directory '/build/tests'
Makefile:740: recipe for target 'vty-test' failed
make[6]: Leaving directory '/build/tests'
make[6]: *** [vty-test] Error 2
make[5]: *** [python-tests] Error 2
Makefile:710: recipe for target 'python-tests' failed
make[5]: Leaving directory '/build/tests'
make[4]: *** [check-local] Error 2
Makefile:763: recipe for target 'check-local' failed
make[4]: Leaving directory '/build/tests'
Makefile:569: recipe for target 'check-am' failed
make[3]: Leaving directory '/build/tests'
make[3]: *** [check-am] Error 2
Makefile:421: recipe for target 'check-recursive' failed
make[2]: Leaving directory '/build/tests'
make[2]: *** [check-recursive] Error 1
make[1]: *** [check-recursive] Error 1
Makefile:469: recipe for target 'check-recursive' failed
make[1]: Leaving directory '/build'
Makefile:760: recipe for target 'check' failed
make: *** [check] Error 2
+ cat-testlogs.sh
Build step 'Execute shell' marked build as failure
[WARNINGS]Skipping publisher since build result is FAILURE


More information about the jenkins-notifications mailing list