Build failed in Jenkins: master-osmo-bsc » a1=default,a2=default,a3=default,a4=default,osmocom-master-debian9 #15348

jenkins at lists.osmocom.org jenkins at lists.osmocom.org
Tue Aug 17 12:20:33 UTC 2021


See <https://jenkins.osmocom.org/jenkins/job/master-osmo-bsc/a1=default,a2=default,a3=default,a4=default,label=osmocom-master-debian9/15348/display/redirect>

Changes:


------------------------------------------
[...truncated 832.50 KB...]
ok
test_unknown_command (__main__.TestVTY) ... Connecting socket failed, retrying...
Socket: in 2 tries, connected to 127.0.0.1:4242 <socket.socket fd=5, family=AddressFamily.AF_INET, type=SocketKind.SOCK_STREAM, proto=0, laddr=('127.0.0.1', 54688), raddr=('127.0.0.1', 4242)> (1 sockets open)
Socket: closing 127.0.0.1:4242 <socket.socket fd=5, family=AddressFamily.AF_INET, type=SocketKind.SOCK_STREAM, proto=0, laddr=('127.0.0.1', 54688), raddr=('127.0.0.1', 4242)> (0 sockets open)
Launch: ./src/osmo-bsc/osmo-bsc -c /build/doc/examples/osmo-bsc/osmo-bsc.cfg from /build
Launching: PWD=/build './src/osmo-bsc/osmo-bsc' '-c' '/build/doc/examples/osmo-bsc/osmo-bsc.cfg'

> ls -l /proc/15733/fd
total 0
lr-x------ 1 build build 64 Aug 17 12:20 0 -> pipe:[1593798250]
l-wx------ 1 build build 64 Aug 17 12:20 1 -> pipe:[1593798251]
l-wx------ 1 build build 64 Aug 17 12:20 2 -> pipe:[1593798252]
l-wx------ 1 build build 64 Aug 17 12:20 3 -> /dev/null


> ss -tn
State      Recv-Q Send-Q Local Address:Port               Peer Address:Port              


> ss -tln
State      Recv-Q Send-Q Local Address:Port               Peer Address:Port              


> ps xua | grep osmo
build    15733 12.0  0.0  53724 20644 ?        S    12:20   0:00 /usr/bin/python3 /usr/local/bin/osmotestvty.py -p /build -w /build -v
build    15756  0.0  0.0 21474986452 35328 ?   R    12:20   0:00 ./src/osmo-bsc/osmo-bsc -c /build/doc/examples/osmo-bsc/osmo-bsc.cfg
build    15763  0.0  0.0   4280   796 ?        S    12:20   0:00 /bin/sh -c ps xua | grep osmo
build    15765  0.0  0.0  12784   976 ?        S    12:20   0:00 grep osmo

ok

----------------------------------------------------------------------
Ran 3 tests in 0.874s

OK
Connecting socket failed, retrying...
Socket: in 2 tries, connected to 127.0.0.1:4242 <socket.socket fd=5, family=AddressFamily.AF_INET, type=SocketKind.SOCK_STREAM, proto=0, laddr=('127.0.0.1', 54694), raddr=('127.0.0.1', 4242)> (1 sockets open)
Socket: closing 127.0.0.1:4242 <socket.socket fd=5, family=AddressFamily.AF_INET, type=SocketKind.SOCK_STREAM, proto=0, laddr=('127.0.0.1', 54694), raddr=('127.0.0.1', 4242)> (0 sockets open)
osmotestconfig.py -p /build -w /build -v
Verifying src/osmo-bsc/osmo-bsc -c /build/doc/examples/osmo-bsc/osmo-bsc.cfg, test verify_doc
Opening /dev/null
Launching: PWD=/build 'src/osmo-bsc/osmo-bsc' '-c' '/build/doc/examples/osmo-bsc/osmo-bsc.cfg'

> ls -l /proc/15767/fd
total 0
lr-x------ 1 build build 64 Aug 17 12:20 0 -> pipe:[1593798250]
l-wx------ 1 build build 64 Aug 17 12:20 1 -> pipe:[1593798251]
l-wx------ 1 build build 64 Aug 17 12:20 2 -> pipe:[1593798252]
l-wx------ 1 build build 64 Aug 17 12:20 3 -> /dev/null
Warning: doc/examples/osmo-bsc/osmo-bsc-minimal.cfg is not being tested
Warning: doc/examples/osmo-bsc/ericsson/osmo-bsc.dug20-rus02-4trx.cfg is not being tested
Warning: doc/examples/osmo-bsc/ericsson/osmo-bsc.dug20-rus01-4trx.cfg is not being tested
Warning: doc/examples/osmo-bsc/ericsson/osmo-bsc.rbs2308.cfg is not being tested
Warning: doc/examples/osmo-bsc/ericsson/osmo-bsc.dug20-rus02-8trx.cfg is not being tested
Warning: doc/examples/osmo-bsc/siemens/osmo-bsc.bs11.cfg is not being tested
Warning: doc/examples/osmo-bsc/nokia/osmo-bsc.insite.cfg is not being tested


> ss -tn
State      Recv-Q Send-Q Local Address:Port               Peer Address:Port              


> ss -tln
State      Recv-Q Send-Q Local Address:Port               Peer Address:Port              


> ps xua | grep osmo
build    15767 10.0  0.0  53788 20680 ?        S    12:20   0:00 /usr/bin/python3 /usr/local/bin/osmotestconfig.py -p /build -w /build -v
build    15768  0.0  0.0 21474986288 31040 ?   R    12:20   0:00 src/osmo-bsc/osmo-bsc -c /build/doc/examples/osmo-bsc/osmo-bsc.cfg
build    15775  0.0  0.0   4280   712 ?        S    12:20   0:00 /bin/sh -c ps xua | grep osmo
build    15777  0.0  0.0  12784   980 ?        S    12:20   0:00 grep osmo

Connecting socket failed, retrying...
Socket: in 2 tries, connected to 127.0.0.1:4242 <socket.socket fd=5, family=AddressFamily.AF_INET, type=SocketKind.SOCK_STREAM, proto=0, laddr=('127.0.0.1', 54708), raddr=('127.0.0.1', 4242)> (1 sockets open)
Terminating took 0.475s
Socket: closing 127.0.0.1:4242 <socket.socket fd=5, family=AddressFamily.AF_INET, type=SocketKind.SOCK_STREAM, proto=0, laddr=('127.0.0.1', 54708), raddr=('127.0.0.1', 4242)> (0 sockets open)
Verifying src/osmo-bsc/osmo-bsc -c /build/writtenconfig/osmo-bsc.cfgbo3ap668, test write_config
Launching: PWD=/build 'src/osmo-bsc/osmo-bsc' '-c' '/build/writtenconfig/osmo-bsc.cfgbo3ap668'

> ls -l /proc/15767/fd
total 0
lr-x------ 1 build build 64 Aug 17 12:20 0 -> pipe:[1593798250]
l-wx------ 1 build build 64 Aug 17 12:20 1 -> pipe:[1593798251]
l-wx------ 1 build build 64 Aug 17 12:20 2 -> pipe:[1593798252]
l-wx------ 1 build build 64 Aug 17 12:20 3 -> /dev/null


> ss -tn
Documentation error (missing docs): 
<command id='no mgw reset-endpoint NAME'>
        <param name='NAME' doc='(null)' />

State      Recv-Q Send-Q Local Address:Port               Peer Address:Port              


> ss -tln
State      Recv-Q Send-Q Local Address:Port               Peer Address:Port              


> ps xua | grep osmo
build    15767  6.0  0.0  54372 21292 ?        S    12:20   0:00 /usr/bin/python3 /usr/local/bin/osmotestconfig.py -p /build -w /build -v
build    15779  0.0  0.0 21474986452 35320 ?   R    12:20   0:00 src/osmo-bsc/osmo-bsc -c /build/writtenconfig/osmo-bsc.cfgbo3ap668
build    15786  0.0  0.0   4280   752 ?        S    12:20   0:00 /bin/sh -c ps xua | grep osmo
build    15788  0.0  0.0  12784   952 ?        S    12:20   0:00 grep osmo

Socket: in 1 tries, connected to 127.0.0.1:4242 <socket.socket fd=4, family=AddressFamily.AF_INET, type=SocketKind.SOCK_STREAM, proto=0, laddr=('127.0.0.1', 54718), raddr=('127.0.0.1', 4242)> (1 sockets open)
Terminating took 0.475s
Socket: closing 127.0.0.1:4242 <socket.socket fd=4, family=AddressFamily.AF_INET, type=SocketKind.SOCK_STREAM, proto=0, laddr=('127.0.0.1', 54718), raddr=('127.0.0.1', 4242)> (0 sockets open)
Verifying src/osmo-bsc/osmo-bsc -c /build/writtenconfig/osmo-bsc.cfgbo3ap668, test token_vty_command
Launching: PWD=/build 'src/osmo-bsc/osmo-bsc' '-c' '/build/writtenconfig/osmo-bsc.cfgbo3ap668'

> ls -l /proc/15767/fd
total 0
lr-x------ 1 build build 64 Aug 17 12:20 0 -> pipe:[1593798250]
l-wx------ 1 build build 64 Aug 17 12:20 1 -> pipe:[1593798251]
l-wx------ 1 build build 64 Aug 17 12:20 2 -> pipe:[1593798252]
l-wx------ 1 build build 64 Aug 17 12:20 3 -> /dev/null


> ss -tn
State      Recv-Q Send-Q Local Address:Port               Peer Address:Port              


> ss -tln
State      Recv-Q Send-Q Local Address:Port               Peer Address:Port              


> ps xua | grep osmo
build    15767  4.3  0.0  54372 21292 ?        S    12:20   0:00 /usr/bin/python3 /usr/local/bin/osmotestconfig.py -p /build -w /build -v
build    15790  0.0  0.0 21474986288 32204 ?   R    12:20   0:00 src/osmo-bsc/osmo-bsc -c /build/writtenconfig/osmo-bsc.cfgbo3ap668
build    15797  0.0  0.0   4280   708 ?        S    12:20   0:00 /bin/sh -c ps xua | grep osmo
build    15799  0.0  0.0  12784   944 ?        S    12:20   0:00 grep osmo

Connecting socket failed, retrying...
Socket: in 2 tries, connected to 127.0.0.1:4242 <socket.socket fd=5, family=AddressFamily.AF_INET, type=SocketKind.SOCK_STREAM, proto=0, laddr=('127.0.0.1', 54748), raddr=('127.0.0.1', 4242)> (1 sockets open)
Terminating took 0.897s
Socket: closing 127.0.0.1:4242 <socket.socket fd=5, family=AddressFamily.AF_INET, type=SocketKind.SOCK_STREAM, proto=0, laddr=('127.0.0.1', 54748), raddr=('127.0.0.1', 4242)> (0 sockets open)
Verifying src/osmo-bsc/osmo-bsc -c /build/doc/examples/osmo-bsc/osmo-bsc_custom-sccp.cfg, test verify_doc
Launching: PWD=/build 'src/osmo-bsc/osmo-bsc' '-c' '/build/doc/examples/osmo-bsc/osmo-bsc_custom-sccp.cfg'

> ls -l /proc/15767/fd
total 0
lr-x------ 1 build build 64 Aug 17 12:20 0 -> pipe:[1593798250]
l-wx------ 1 build build 64 Aug 17 12:20 1 -> pipe:[1593798251]
l-wx------ 1 build build 64 Aug 17 12:20 2 -> pipe:[1593798252]
l-wx------ 1 build build 64 Aug 17 12:20 3 -> /dev/null


> ss -tn
State      Recv-Q Send-Q Local Address:Port               Peer Address:Port              


> ss -tln
State      Recv-Q Send-Q Local Address:Port               Peer Address:Port              


> ps xua | grep osmo
build    15767  3.2  0.0  54372 21292 ?        S    12:20   0:00 /usr/bin/python3 /usr/local/bin/osmotestconfig.py -p /build -w /build -v
build    15801  0.0  0.0 21474986288 33176 ?   R    12:20   0:00 src/osmo-bsc/osmo-bsc -c /build/doc/examples/osmo-bsc/osmo-bsc_custom-sccp.cfg
build    15808  0.0  0.0   4280   796 ?        S    12:20   0:00 /bin/sh -c ps xua | grep osmo
build    15810  0.0  0.0  12784   976 ?        S    12:20   0:00 grep osmo

Connecting socket failed, retrying...
Socket: in 2 tries, connected to 127.0.0.1:4242 <socket.socket fd=5, family=AddressFamily.AF_INET, type=SocketKind.SOCK_STREAM, proto=0, laddr=('127.0.0.1', 54768), raddr=('127.0.0.1', 4242)> (1 sockets open)
Terminating took 0.475s
Socket: closing 127.0.0.1:4242 <socket.socket fd=5, family=AddressFamily.AF_INET, type=SocketKind.SOCK_STREAM, proto=0, laddr=('127.0.0.1', 54768), raddr=('127.0.0.1', 4242)> (0 sockets open)
Verifying src/osmo-bsc/osmo-bsc -c /build/writtenconfig/osmo-bsc_custom-sccp.cfg2lui95w8, test write_config
Launching: PWD=/build 'src/osmo-bsc/osmo-bsc' '-c' '/build/writtenconfig/osmo-bsc_custom-sccp.cfg2lui95w8'

> ls -l /proc/15767/fd
total 0
lr-x------ 1 build build 64 Aug 17 12:20 0 -> pipe:[1593798250]
l-wx------ 1 build build 64 Aug 17 12:20 1 -> pipe:[1593798251]
l-wx------ 1 build build 64 Aug 17 12:20 2 -> pipe:[1593798252]
l-wx------ 1 build build 64 Aug 17 12:20 3 -> /dev/null


> ss -tn
Documentation error (missing docs): 
<command id='no mgw reset-endpoint NAME'>
        <param name='NAME' doc='(null)' />

State      Recv-Q Send-Q Local Address:Port               Peer Address:Port              


> ss -tln
State      Recv-Q Send-Q Local Address:Port               Peer Address:Port              


> ps xua | grep osmo
build    15767  3.0  0.0  54256 21304 ?        S    12:20   0:00 /usr/bin/python3 /usr/local/bin/osmotestconfig.py -p /build -w /build -v
build    15812  0.0  0.0 21474986288 32596 ?   R    12:20   0:00 src/osmo-bsc/osmo-bsc -c /build/writtenconfig/osmo-bsc_custom-sccp.cfg2lui95w8
build    15819  0.0  0.0   4280   712 ?        S    12:20   0:00 /bin/sh -c ps xua | grep osmo
build    15821  0.0  0.0  12784   976 ?        S    12:20   0:00 grep osmo

Connecting socket failed, retrying...
Socket: in 2 tries, connected to 127.0.0.1:4242 <socket.socket fd=5, family=AddressFamily.AF_INET, type=SocketKind.SOCK_STREAM, proto=0, laddr=('127.0.0.1', 54796), raddr=('127.0.0.1', 4242)> (1 sockets open)
Terminating took 0.475s
Socket: closing 127.0.0.1:4242 <socket.socket fd=5, family=AddressFamily.AF_INET, type=SocketKind.SOCK_STREAM, proto=0, laddr=('127.0.0.1', 54796), raddr=('127.0.0.1', 4242)> (0 sockets open)
Verifying src/osmo-bsc/osmo-bsc -c /build/writtenconfig/osmo-bsc_custom-sccp.cfg2lui95w8, test token_vty_command
Launching: PWD=/build 'src/osmo-bsc/osmo-bsc' '-c' '/build/writtenconfig/osmo-bsc_custom-sccp.cfg2lui95w8'

> ls -l /proc/15767/fd
total 0
lr-x------ 1 build build 64 Aug 17 12:20 0 -> pipe:[1593798250]
l-wx------ 1 build build 64 Aug 17 12:20 1 -> pipe:[1593798251]
l-wx------ 1 build build 64 Aug 17 12:20 2 -> pipe:[1593798252]
l-wx------ 1 build build 64 Aug 17 12:20 3 -> /dev/null


> ss -tn
State      Recv-Q Send-Q Local Address:Port               Peer Address:Port              


> ss -tln
State      Recv-Q Send-Q Local Address:Port               Peer Address:Port              


> ps xua | grep osmo
build    15767  2.6  0.0  54256 21304 ?        S    12:20   0:00 /usr/bin/python3 /usr/local/bin/osmotestconfig.py -p /build -w /build -v
build    15823  0.0  0.0 21474986288 33520 ?   R    12:20   0:00 src/osmo-bsc/osmo-bsc -c /build/writtenconfig/osmo-bsc_custom-sccp.cfg2lui95w8
build    15830  0.0  0.0   4280   700 ?        S    12:20   0:00 /bin/sh -c ps xua | grep osmo
build    15832  0.0  0.0  12784   928 ?        S    12:20   0:00 grep osmo

Connecting socket failed, retrying...
Socket: in 2 tries, connected to 127.0.0.1:4242 <socket.socket fd=5, family=AddressFamily.AF_INET, type=SocketKind.SOCK_STREAM, proto=0, laddr=('127.0.0.1', 54812), raddr=('127.0.0.1', 4242)> (1 sockets open)
Terminating took 0.897s
Socket: closing 127.0.0.1:4242 <socket.socket fd=5, family=AddressFamily.AF_INET, type=SocketKind.SOCK_STREAM, proto=0, laddr=('127.0.0.1', 54812), raddr=('127.0.0.1', 4242)> (0 sockets open)
ERRORS: 2
make[5]: *** [python-tests] Error 2
Makefile:708: recipe for target 'python-tests' failed
make[5]: Leaving directory '/build/tests'
Makefile:730: recipe for target 'check-local' failed
make[4]: Leaving directory '/build/tests'
make[4]: *** [check-local] Error 2
make[3]: *** [check-am] Error 2
Makefile:568: recipe for target 'check-am' failed
make[3]: Leaving directory '/build/tests'
make[2]: *** [check-recursive] Error 1
Makefile:420: recipe for target 'check-recursive' failed
make[2]: Leaving directory '/build/tests'
Makefile:453: recipe for target 'check-recursive' failed
make[1]: Leaving directory '/build'
make[1]: *** [check-recursive] Error 1
make: *** [check] Error 2
Makefile:744: recipe for target 'check' failed
+ cat-testlogs.sh
Build step 'Execute shell' marked build as failure
[WARNINGS]Skipping publisher since build result is FAILURE


More information about the jenkins-notifications mailing list