Build failed in Jenkins: master-osmo-sgsn » --disable-iu,1,a3=default,a4=default,osmocom-master-debian9 #21139

jenkins at lists.osmocom.org jenkins at lists.osmocom.org
Mon Oct 12 13:24:09 UTC 2020


See <https://jenkins.osmocom.org/jenkins/job/master-osmo-sgsn/IU=--disable-iu,WITH_MANUALS=1,a3=default,a4=default,label=osmocom-master-debian9/21139/display/redirect>

Changes:


------------------------------------------
[...truncated 347.34 KB...]
xsltproc -o listings.xml --xinclude --xincludestyle --param current.dir '/build/doc/manuals' /usr/share/dblatex/xsl/common/mklistings.xsl /build/doc/manuals/osmosgsn-usermanual.xml
xsltproc -o osmosgsn-usermanual.rtex --xinclude --xincludestyle --param current.dir '/build/doc/manuals' --param listings.xml '/tmp/tmpHIWFvM/listings.xml' /tmp/tmpHIWFvM/custom.xsl /build/doc/manuals/osmosgsn-usermanual.xml
XSLT stylesheets DocBook - LaTeX 2e (0.3.9-3)
===================================================
Error: no ID for constraint linkend: ctrl_common_var.
XRef to nonexistent id: ctrl_common_var
Error: no ID for constraint linkend: bssgp:bss_ctx_packets:in.
XRef to nonexistent id: bssgp:bss_ctx_packets:in
Error: no ID for constraint linkend: bssgp:bss_ctx_packets:out.
XRef to nonexistent id: bssgp:bss_ctx_packets:out
Error: no ID for constraint linkend: bssgp:bss_ctx_bytes:in.
XRef to nonexistent id: bssgp:bss_ctx_bytes:in
Error: no ID for constraint linkend: bssgp:bss_ctx_bytes:out.
XRef to nonexistent id: bssgp:bss_ctx_bytes:out
Error: no ID for constraint linkend: bssgp:bss_ctx_blocked.
XRef to nonexistent id: bssgp:bss_ctx_blocked
Error: no ID for constraint linkend: bssgp:bss_ctx_discarded.
XRef to nonexistent id: bssgp:bss_ctx_discarded
Error: no ID for constraint linkend: bssgp:bss_ctx_status.
XRef to nonexistent id: bssgp:bss_ctx_status
Error: no ID for constraint linkend: sgsn_llc:dl_bytes.
XRef to nonexistent id: sgsn_llc:dl_bytes
Error: no ID for constraint linkend: sgsn_llc:ul_bytes.
XRef to nonexistent id: sgsn_llc:ul_bytes
Error: no ID for constraint linkend: sgsn_llc:dl_packets.
XRef to nonexistent id: sgsn_llc:dl_packets
Error: no ID for constraint linkend: sgsn_llc:ul_packets.
XRef to nonexistent id: sgsn_llc:ul_packets
Error: no ID for constraint linkend: sgsn_gprs:attach_requested.
XRef to nonexistent id: sgsn_gprs:attach_requested
Error: no ID for constraint linkend: sgsn_gprs:attach_accepted.
XRef to nonexistent id: sgsn_gprs:attach_accepted
Error: no ID for constraint linkend: sgsn_gprs:attach_rejected.
XRef to nonexistent id: sgsn_gprs:attach_rejected
Error: no ID for constraint linkend: sgsn_gprs:detach_requested.
XRef to nonexistent id: sgsn_gprs:detach_requested
Error: no ID for constraint linkend: sgsn_gprs:detach_acked.
XRef to nonexistent id: sgsn_gprs:detach_acked
Error: no ID for constraint linkend: sgsn_gprs:routing_area_requested.
XRef to nonexistent id: sgsn_gprs:routing_area_requested
Error: no ID for constraint linkend: sgsn_gprs:routing_area_requested.
XRef to nonexistent id: sgsn_gprs:routing_area_requested
Error: no ID for constraint linkend: sgsn_gprs:routing_area_requested.
XRef to nonexistent id: sgsn_gprs:routing_area_requested
Error: no ID for constraint linkend: sgsn_pdp:activate_requested.
XRef to nonexistent id: sgsn_pdp:activate_requested
Error: no ID for constraint linkend: sgsn_pdp:activate_rejected.
XRef to nonexistent id: sgsn_pdp:activate_rejected
Error: no ID for constraint linkend: sgsn_pdp:activate_accepted.
XRef to nonexistent id: sgsn_pdp:activate_accepted
Error: no ID for constraint linkend: sgsn_pdp:request_activated.
XRef to nonexistent id: sgsn_pdp:request_activated
Error: no ID for constraint linkend: sgsn_pdp:request_activate_rejected.
XRef to nonexistent id: sgsn_pdp:request_activate_rejected
Error: no ID for constraint linkend: sgsn_pdp:modify_requested.
XRef to nonexistent id: sgsn_pdp:modify_requested
Error: no ID for constraint linkend: sgsn_pdp:modify_accepted.
XRef to nonexistent id: sgsn_pdp:modify_accepted
Error: no ID for constraint linkend: sgsn_pdp:dl_deactivate_requested.
XRef to nonexistent id: sgsn_pdp:dl_deactivate_requested
Error: no ID for constraint linkend: sgsn_pdp:dl_deactivate_accepted.
XRef to nonexistent id: sgsn_pdp:dl_deactivate_accepted
Error: no ID for constraint linkend: sgsn_pdp:ul_deactivate_requested.
XRef to nonexistent id: sgsn_pdp:ul_deactivate_requested
Error: no ID for constraint linkend: sgsn_pdp:ul_deactivate_accepted.
XRef to nonexistent id: sgsn_pdp:ul_deactivate_accepted
Error: no ID for constraint linkend: ns:nsvc_packets:in.
XRef to nonexistent id: ns:nsvc_packets:in
Error: no ID for constraint linkend: ns:nsvc_packets:out.
XRef to nonexistent id: ns:nsvc_packets:out
Error: no ID for constraint linkend: ns:nsvc_bytes:in.
XRef to nonexistent id: ns:nsvc_bytes:in
Error: no ID for constraint linkend: ns:nsvc_bytes:out.
XRef to nonexistent id: ns:nsvc_bytes:out
Error: no ID for constraint linkend: ns:nsvc_blocked.
XRef to nonexistent id: ns:nsvc_blocked
Error: no ID for constraint linkend: ns:nsvc_dead.
XRef to nonexistent id: ns:nsvc_dead
Error: no ID for constraint linkend: ns:nsvc_replaced.
XRef to nonexistent id: ns:nsvc_replaced
Error: no ID for constraint linkend: ns:nsvc_nsei-chg.
XRef to nonexistent id: ns:nsvc_nsei-chg
Error: no ID for constraint linkend: ns:nsvc_inv-nsvci.
XRef to nonexistent id: ns:nsvc_inv-nsvci
Error: no ID for constraint linkend: ns:nsvc_inv-nsei.
XRef to nonexistent id: ns:nsvc_inv-nsei
Error: no ID for constraint linkend: ns:nsvc_lost:alive.
XRef to nonexistent id: ns:nsvc_lost:alive
Error: no ID for constraint linkend: ns:nsvc_lost:reset.
XRef to nonexistent id: ns:nsvc_lost:reset
Error: no ID for constraint linkend: ns.nsvc_alive.delay.
XRef to nonexistent id: ns.nsvc_alive.delay
Error: no ID for constraint linkend: ietf-rfc791.
XRef to nonexistent id: ietf-rfc791
Section level > 6 not well supported for bibliodiv
Error: no ID for constraint linkend: modified-vesion.
XRef to nonexistent id: modified-vesion
Image 'dblatex' not found
Cannot convert 'osmosgsn-usermanual__1.png' to pdf
Cannot convert './common/images/wireshark-gsmtap-log.png' to pdf
Cannot convert 'osmosgsn-usermanual__2.png' to pdf
Cannot convert 'osmosgsn-usermanual__3.png' to pdf
Cannot convert 'osmosgsn-usermanual__4.png' to pdf
Cannot convert 'osmosgsn-usermanual__5.png' to pdf
Cannot convert 'osmosgsn-usermanual__6.png' to pdf
Cannot convert 'osmosgsn-usermanual__7.png' to pdf
Cannot convert 'osmosgsn-usermanual__8.png' to pdf
Cannot convert 'osmosgsn-usermanual__9.png' to pdf
Cannot convert 'osmosgsn-usermanual__10.png' to pdf
Cannot convert 'osmosgsn-usermanual__11.png' to pdf
Cannot convert 'osmosgsn-usermanual__12.png' to pdf
Cannot convert 'osmosgsn-usermanual__13.png' to pdf
Cannot convert 'osmosgsn-usermanual__14.png' to pdf
Cannot convert 'osmosgsn-usermanual__15.png' to pdf
Cannot convert 'osmosgsn-usermanual__16.png' to pdf
Cannot convert 'osmosgsn-usermanual__17.png' to pdf
Cannot convert 'osmosgsn-usermanual__18.png' to pdf
Cannot convert 'osmosgsn-usermanual__19.png' to pdf
Cannot convert 'osmosgsn-usermanual__20.png' to pdf
Cannot convert 'osmosgsn-usermanual__21.png' to pdf
Cannot convert 'osmosgsn-usermanual__22.png' to pdf
Cannot convert 'osmosgsn-usermanual__23.png' to pdf
Cannot convert 'osmosgsn-usermanual__24.png' to pdf
Cannot convert 'osmosgsn-usermanual__25.png' to pdf
Cannot convert 'osmosgsn-usermanual__26.png' to pdf
Cannot convert 'osmosgsn-usermanual__27.png' to pdf
Cannot convert 'osmosgsn-usermanual__28.png' to pdf
Cannot convert 'osmosgsn-usermanual__29.png' to pdf
Cannot convert 'osmosgsn-usermanual__30.png' to pdf
Cannot convert 'osmosgsn-usermanual__31.png' to pdf
Cannot convert 'osmosgsn-usermanual__32.png' to pdf
Cannot convert 'osmosgsn-usermanual__33.png' to pdf
Cannot convert 'osmosgsn-usermanual__34.png' to pdf
Cannot convert 'osmosgsn-usermanual__35.png' to pdf
Cannot convert 'osmosgsn-usermanual__36.png' to pdf
Cannot convert 'osmosgsn-usermanual__37.png' to pdf
Cannot convert 'osmosgsn-usermanual__38.png' to pdf
Build osmosgsn-usermanual.pdf
built-in module pdftex registered
no support found for ifthen
no support found for ifxetex
no support found for fontspec
no support found for xltxtra
no support found for fontenc
no support found for inputenc
no support found for fancybox
built-in module makeidx registered
no support found for custom-dblatex
built-in module bibtopic registered
building additional files...
checking if compiling is necessary...
the output file doesn't exist
pdflatex -interaction=batchmode osmosgsn-usermanual.tex
running post-compilation scripts...
[index] the index file /tmp/tmpHIWFvM/osmosgsn-usermanual.idx is empty
osmosgsn-usermanual.aux MD5 checksum changed
osmosgsn-usermanual.toc MD5 checksum changed
the /tmp/tmpHIWFvM/osmosgsn-usermanual.aux file has changed
pdflatex -interaction=batchmode osmosgsn-usermanual.tex
running post-compilation scripts...
[index] the index file /tmp/tmpHIWFvM/osmosgsn-usermanual.idx is empty
no new compilation is needed
running last-compilation scripts...
'osmosgsn-usermanual.pdf' successfully built

a2x: deleting /build/doc/manuals/osmosgsn-usermanual.xml
rm generated/docbook_osmogbproxy-vty-reference.xml
make[3]: Leaving directory '/build/doc/manuals'
make[3]: Entering directory '/build/doc'
make[3]: Nothing to be done for 'all-am'.
make[3]: Leaving directory '/build/doc'
make[2]: Leaving directory '/build/doc'
Making all in include
make[2]: Entering directory '/build/include'
Making all in osmocom
make[3]: Entering directory '/build/include/osmocom'
Making all in sgsn
make[4]: Entering directory '/build/include/osmocom/sgsn'
make[4]: Nothing to be done for 'all'.
make[4]: Leaving directory '/build/include/osmocom/sgsn'
make[4]: Entering directory '/build/include/osmocom'
make[4]: Nothing to be done for 'all-am'.
make[4]: Leaving directory '/build/include/osmocom'
make[3]: Leaving directory '/build/include/osmocom'
make[3]: Entering directory '/build/include'
make[3]: Nothing to be done for 'all-am'.
make[3]: Leaving directory '/build/include'
make[2]: Leaving directory '/build/include'
Making all in src
make[2]: Entering directory '/build/src'
Making all in gprs
make[3]: Entering directory '/build/src/gprs'
  CC       gprs_gb_parse.lo
  CC       crc24.lo
  CC       gprs_llc_parse.lo
  CC       gprs_utils.lo
  CC       sgsn_ares.lo
  CCLD     libcommon.la
ar: `u' modifier ignored since `D' is the default (see `U')
make[3]: Leaving directory '/build/src/gprs'
Making all in sgsn
make[3]: Entering directory '/build/src/sgsn'
  CC       gprs_gmm_attach.o
  CC       gprs_gmm.o
  CC       gprs_gb.o
  CC       gprs_sm.o
  CC       gprs_mm_state_gb_fsm.o
  CC       gprs_gmm_fsm.o
  CC       gprs_sndcp.o
  CC       gprs_sgsn.o
  CC       gprs_sndcp_comp.o
  CC       gprs_sndcp_dcomp.o
  CC       gprs_sndcp_pcomp.o
  CC       gprs_sndcp_vty.o
  CC       gprs_sndcp_xid.o
  CC       sgsn_main.o
  CC       sgsn_vty.o
  CC       sgsn_libgtp.o
sgsn_libgtp.c:111:17: error: conflicting types for ‘imsi_str2gtp’
 static uint64_t imsi_str2gtp(char *str)
                 ^~~~~~~~~~~~
In file included from ../../include/osmocom/sgsn/sgsn.h:20:0,
                 from sgsn_libgtp.c:47:
/build/deps/install/stow/osmo-ggsn/include/gtp.h:444:23: note: previous declaration of ‘imsi_str2gtp’ was here
 extern const uint64_t imsi_str2gtp(const char *imsi);
                       ^~~~~~~~~~~~
sgsn_libgtp.c: In function ‘sgsn_gtp_init’:
sgsn_libgtp.c:814:2: warning: ‘gtp_set_cb_recovery2’ is deprecated: Use gtp_set_cb_recovery3() instead, to obtain gsn handling the recovery [-Wdeprecated-declarations]
  gtp_set_cb_recovery2(gsn, cb_recovery2);
  ^~~~~~~~~~~~~~~~~~~~
In file included from ../../include/osmocom/sgsn/sgsn.h:20:0,
                 from sgsn_libgtp.c:47:
/build/deps/install/stow/osmo-ggsn/include/gtp.h:377:5: note: declared here
 int gtp_set_cb_recovery2(struct gsn_t *gsn,
     ^~~~~~~~~~~~~~~~~~~~
Makefile:536: recipe for target 'sgsn_libgtp.o' failed
make[3]: *** [sgsn_libgtp.o] Error 1
make[3]: *** Waiting for unfinished jobs....
make[3]: Leaving directory '/build/src/sgsn'
make[2]: *** [all-recursive] Error 1
Makefile:395: recipe for target 'all-recursive' failed
make[2]: Leaving directory '/build/src'
make[1]: *** [all-recursive] Error 1
Makefile:461: recipe for target 'all-recursive' failed
make[1]: Leaving directory '/build'
Makefile:393: recipe for target 'all' failed
make: *** [all] Error 2
Build step 'Execute shell' marked build as failure
[WARNINGS]Skipping publisher since build result is FAILURE


More information about the jenkins-notifications mailing list