Build failed in Jenkins: master-osmo-sgsn » --enable-iu,0,a3=default,a4=default,osmocom-master-debian9 #21137

jenkins at lists.osmocom.org jenkins at lists.osmocom.org
Mon Oct 12 11:26:34 UTC 2020


See <https://jenkins.osmocom.org/jenkins/job/master-osmo-sgsn/IU=--enable-iu,WITH_MANUALS=0,a3=default,a4=default,label=osmocom-master-debian9/21137/display/redirect>

Changes:


------------------------------------------
[...truncated 644.12 KB...]
/build/deps/install/stow/libasn1c/include/asn1c/asn_SET_OF.h:17:16: note: in definition of macro ‘A_SET_OF’
   void (*free)(type *);   \
                ^~~~
/build/deps/install/stow/osmo-iuh/include/osmocom/ranap/RANAP_MessageStructure.h:27:2: note: in expansion of macro ‘A_SEQUENCE_OF’
  A_SEQUENCE_OF(struct MemberL {
  ^~~~~~~~~~~~~
/build/deps/install/stow/osmo-iuh/include/osmocom/ranap/RANAP_PLMNs-in-shared-network.h:27:23: warning: ‘struct MemberM’ declared inside parameter list will not be visible outside of this definition or declaration
  A_SEQUENCE_OF(struct MemberM {
                       ^
/build/deps/install/stow/libasn1c/include/asn1c/asn_SET_OF.h:17:16: note: in definition of macro ‘A_SET_OF’
   void (*free)(type *);   \
                ^~~~
/build/deps/install/stow/osmo-iuh/include/osmocom/ranap/RANAP_PLMNs-in-shared-network.h:27:2: note: in expansion of macro ‘A_SEQUENCE_OF’
  A_SEQUENCE_OF(struct MemberM {
  ^~~~~~~~~~~~~
/build/deps/install/stow/osmo-iuh/include/osmocom/ranap/RANAP_RABDataVolumeReport.h:27:23: warning: ‘struct MemberN’ declared inside parameter list will not be visible outside of this definition or declaration
  A_SEQUENCE_OF(struct MemberN {
                       ^
/build/deps/install/stow/libasn1c/include/asn1c/asn_SET_OF.h:17:16: note: in definition of macro ‘A_SET_OF’
   void (*free)(type *);   \
                ^~~~
/build/deps/install/stow/osmo-iuh/include/osmocom/ranap/RANAP_RABDataVolumeReport.h:27:2: note: in expansion of macro ‘A_SEQUENCE_OF’
  A_SEQUENCE_OF(struct MemberN {
  ^~~~~~~~~~~~~
/build/deps/install/stow/osmo-iuh/include/osmocom/ranap/RANAP_RABParametersList.h:29:23: warning: ‘struct MemberB’ declared inside parameter list will not be visible outside of this definition or declaration
  A_SEQUENCE_OF(struct MemberB {
                       ^
/build/deps/install/stow/libasn1c/include/asn1c/asn_SET_OF.h:17:16: note: in definition of macro ‘A_SET_OF’
   void (*free)(type *);   \
                ^~~~
/build/deps/install/stow/osmo-iuh/include/osmocom/ranap/RANAP_RABParametersList.h:29:2: note: in expansion of macro ‘A_SEQUENCE_OF’
  A_SEQUENCE_OF(struct MemberB {
  ^~~~~~~~~~~~~
/build/deps/install/stow/osmo-iuh/include/osmocom/ranap/RANAP_UnsuccessfulLinking-IEs.h:27:23: warning: ‘struct MemberD’ declared inside parameter list will not be visible outside of this definition or declaration
  A_SEQUENCE_OF(struct MemberD {
                       ^
/build/deps/install/stow/libasn1c/include/asn1c/asn_SET_OF.h:17:16: note: in definition of macro ‘A_SET_OF’
   void (*free)(type *);   \
                ^~~~
/build/deps/install/stow/osmo-iuh/include/osmocom/ranap/RANAP_UnsuccessfulLinking-IEs.h:27:2: note: in expansion of macro ‘A_SEQUENCE_OF’
  A_SEQUENCE_OF(struct MemberD {
  ^~~~~~~~~~~~~
In file included from /build/deps/install/stow/osmo-iuh/include/osmocom/ranap/ranap_common.h:592:0,
                 from /build/deps/install/stow/osmo-iuh/include/osmocom/ranap/ranap_ies_defs.h:7,
                 from ../../include/osmocom/sgsn/gprs_ranap.h:7,
                 from sgsn_main.c:62:
/build/deps/install/stow/osmo-iuh/include/osmocom/ranap/ranap_ies_defs.h:462:0: warning: "ENHANCEDRELOCATIONCOMPLETEREQUESTIES_RANAP_EXTENDEDRNC_ID_PRESENT" redefined
 #define ENHANCEDRELOCATIONCOMPLETEREQUESTIES_RANAP_EXTENDEDRNC_ID_PRESENT                   (1 << 1)
 
/build/deps/install/stow/osmo-iuh/include/osmocom/ranap/ranap_ies_defs.h:461:0: note: this is the location of the previous definition
 #define ENHANCEDRELOCATIONCOMPLETEREQUESTIES_RANAP_EXTENDEDRNC_ID_PRESENT                   (1 << 0)
 
/build/deps/install/stow/osmo-iuh/include/osmocom/ranap/ranap_ies_defs.h:586:0: warning: "RANAP_ENHANCEDRELOCATIONINFORMATIONREQUESTIES_RANAP_IUSIGNALLINGCONNECTIONIDENTIFIER_PRESENT" redefined
 #define RANAP_ENHANCEDRELOCATIONINFORMATIONREQUESTIES_RANAP_IUSIGNALLINGCONNECTIONIDENTIFIER_PRESENT     (1 << 2)
 
/build/deps/install/stow/osmo-iuh/include/osmocom/ranap/ranap_ies_defs.h:584:0: note: this is the location of the previous definition
 #define RANAP_ENHANCEDRELOCATIONINFORMATIONREQUESTIES_RANAP_IUSIGNALLINGCONNECTIONIDENTIFIER_PRESENT     (1 << 0)
 
/build/deps/install/stow/osmo-iuh/include/osmocom/ranap/ranap_ies_defs.h:587:0: warning: "RANAP_ENHANCEDRELOCATIONINFORMATIONREQUESTIES_RANAP_GLOBALCN_ID_PRESENT" redefined
 #define RANAP_ENHANCEDRELOCATIONINFORMATIONREQUESTIES_RANAP_GLOBALCN_ID_PRESENT                          (1 << 3)
 
/build/deps/install/stow/osmo-iuh/include/osmocom/ranap/ranap_ies_defs.h:585:0: note: this is the location of the previous definition
 #define RANAP_ENHANCEDRELOCATIONINFORMATIONREQUESTIES_RANAP_GLOBALCN_ID_PRESENT                          (1 << 1)
 
  CC       sgsn_libgtp.o
In file included from /build/deps/install/stow/libasn1c/include/asn1c/asn_SEQUENCE_OF.h:8:0,
                 from /build/deps/install/stow/osmo-iuh/include/osmocom/ranap/RANAP_IE-Extensions.h:15,
                 from /build/deps/install/stow/osmo-iuh/include/osmocom/ranap/RANAP_AllocationOrRetentionPriority.h:18,
                 from /build/deps/install/stow/osmo-iuh/include/osmocom/ranap/ranap_common.h:8,
                 from /build/deps/install/stow/osmo-iuh/include/osmocom/ranap/ranap_ies_defs.h:7,
                 from ../../include/osmocom/sgsn/gprs_ranap.h:7,
                 from sgsn_libgtp.c:55:
/build/deps/install/stow/osmo-iuh/include/osmocom/ranap/RANAP_GA-Polygon.h:26:23: warning: ‘struct Member’ declared inside parameter list will not be visible outside of this definition or declaration
  A_SEQUENCE_OF(struct Member {
                       ^
/build/deps/install/stow/libasn1c/include/asn1c/asn_SET_OF.h:17:16: note: in definition of macro ‘A_SET_OF’
   void (*free)(type *);   \
                ^~~~
/build/deps/install/stow/osmo-iuh/include/osmocom/ranap/RANAP_GA-Polygon.h:26:2: note: in expansion of macro ‘A_SEQUENCE_OF’
  A_SEQUENCE_OF(struct Member {
  ^~~~~~~~~~~~~
/build/deps/install/stow/osmo-iuh/include/osmocom/ranap/RANAP_AuthorisedPLMNs.h:27:23: warning: ‘struct MemberC’ declared inside parameter list will not be visible outside of this definition or declaration
  A_SEQUENCE_OF(struct MemberC {
                       ^
/build/deps/install/stow/libasn1c/include/asn1c/asn_SET_OF.h:17:16: note: in definition of macro ‘A_SET_OF’
   void (*free)(type *);   \
                ^~~~
/build/deps/install/stow/osmo-iuh/include/osmocom/ranap/RANAP_AuthorisedPLMNs.h:27:2: note: in expansion of macro ‘A_SEQUENCE_OF’
  A_SEQUENCE_OF(struct MemberC {
  ^~~~~~~~~~~~~
/build/deps/install/stow/osmo-iuh/include/osmocom/ranap/RANAP_JoinedMBMSBearerService-IEs.h:27:23: warning: ‘struct MemberF’ declared inside parameter list will not be visible outside of this definition or declaration
  A_SEQUENCE_OF(struct MemberF {
                       ^
/build/deps/install/stow/libasn1c/include/asn1c/asn_SET_OF.h:17:16: note: in definition of macro ‘A_SET_OF’
   void (*free)(type *);   \
                ^~~~
/build/deps/install/stow/osmo-iuh/include/osmocom/ranap/RANAP_JoinedMBMSBearerService-IEs.h:27:2: note: in expansion of macro ‘A_SEQUENCE_OF’
  A_SEQUENCE_OF(struct MemberF {
  ^~~~~~~~~~~~~
/build/deps/install/stow/osmo-iuh/include/osmocom/ranap/RANAP_CriticalityDiagnostics-IE-List.h:28:23: warning: ‘struct MemberG’ declared inside parameter list will not be visible outside of this definition or declaration
  A_SEQUENCE_OF(struct MemberG {
                       ^
/build/deps/install/stow/libasn1c/include/asn1c/asn_SET_OF.h:17:16: note: in definition of macro ‘A_SET_OF’
   void (*free)(type *);   \
                ^~~~
/build/deps/install/stow/osmo-iuh/include/osmocom/ranap/RANAP_CriticalityDiagnostics-IE-List.h:28:2: note: in expansion of macro ‘A_SEQUENCE_OF’
  A_SEQUENCE_OF(struct MemberG {
  ^~~~~~~~~~~~~
/build/deps/install/stow/osmo-iuh/include/osmocom/ranap/RANAP_DataVolumeList.h:27:23: warning: ‘struct MemberH’ declared inside parameter list will not be visible outside of this definition or declaration
  A_SEQUENCE_OF(struct MemberH {
                       ^
/build/deps/install/stow/libasn1c/include/asn1c/asn_SET_OF.h:17:16: note: in definition of macro ‘A_SET_OF’
   void (*free)(type *);   \
                ^~~~
/build/deps/install/stow/osmo-iuh/include/osmocom/ranap/RANAP_DataVolumeList.h:27:2: note: in expansion of macro ‘A_SEQUENCE_OF’
  A_SEQUENCE_OF(struct MemberH {
  ^~~~~~~~~~~~~
/build/deps/install/stow/osmo-iuh/include/osmocom/ranap/RANAP_EUTRANFrequencies.h:27:23: warning: ‘struct MemberJ’ declared inside parameter list will not be visible outside of this definition or declaration
  A_SEQUENCE_OF(struct MemberJ {
                       ^
/build/deps/install/stow/libasn1c/include/asn1c/asn_SET_OF.h:17:16: note: in definition of macro ‘A_SET_OF’
   void (*free)(type *);   \
                ^~~~
/build/deps/install/stow/osmo-iuh/include/osmocom/ranap/RANAP_EUTRANFrequencies.h:27:2: note: in expansion of macro ‘A_SEQUENCE_OF’
  A_SEQUENCE_OF(struct MemberJ {
  ^~~~~~~~~~~~~
In file included from /build/deps/install/stow/libasn1c/include/asn1c/asn_SEQUENCE_OF.h:8:0,
                 from /build/deps/install/stow/osmo-iuh/include/osmocom/ranap/RANAP_IE-Extensions.h:15,
                 from /build/deps/install/stow/osmo-iuh/include/osmocom/ranap/RANAP_AllocationOrRetentionPriority.h:18,
                 from /build/deps/install/stow/osmo-iuh/include/osmocom/ranap/ranap_common.h:8,
                 from /build/deps/install/stow/osmo-iuh/include/osmocom/ranap/ranap_ies_defs.h:7,
                 from ../../include/osmocom/sgsn/gprs_ranap.h:7,
                 from sgsn_libgtp.c:55:
/build/deps/install/stow/osmo-iuh/include/osmocom/ranap/RANAP_LA-LIST.h:27:23: warning: ‘struct MemberA’ declared inside parameter list will not be visible outside of this definition or declaration
  A_SEQUENCE_OF(struct MemberA {
                       ^
/build/deps/install/stow/libasn1c/include/asn1c/asn_SET_OF.h:17:16: note: in definition of macro ‘A_SET_OF’
   void (*free)(type *);   \
                ^~~~
/build/deps/install/stow/osmo-iuh/include/osmocom/ranap/RANAP_LA-LIST.h:27:2: note: in expansion of macro ‘A_SEQUENCE_OF’
  A_SEQUENCE_OF(struct MemberA {
  ^~~~~~~~~~~~~
/build/deps/install/stow/osmo-iuh/include/osmocom/ranap/RANAP_LeftMBMSBearerService-IEs.h:26:23: warning: ‘struct MemberK’ declared inside parameter list will not be visible outside of this definition or declaration
  A_SEQUENCE_OF(struct MemberK {
                       ^
/build/deps/install/stow/libasn1c/include/asn1c/asn_SET_OF.h:17:16: note: in definition of macro ‘A_SET_OF’
   void (*free)(type *);   \
                ^~~~
/build/deps/install/stow/osmo-iuh/include/osmocom/ranap/RANAP_LeftMBMSBearerService-IEs.h:26:2: note: in expansion of macro ‘A_SEQUENCE_OF’
  A_SEQUENCE_OF(struct MemberK {
  ^~~~~~~~~~~~~
/build/deps/install/stow/osmo-iuh/include/osmocom/ranap/RANAP_MessageStructure.h:27:23: warning: ‘struct MemberL’ declared inside parameter list will not be visible outside of this definition or declaration
  A_SEQUENCE_OF(struct MemberL {
                       ^
/build/deps/install/stow/libasn1c/include/asn1c/asn_SET_OF.h:17:16: note: in definition of macro ‘A_SET_OF’
   void (*free)(type *);   \
                ^~~~
/build/deps/install/stow/osmo-iuh/include/osmocom/ranap/RANAP_MessageStructure.h:27:2: note: in expansion of macro ‘A_SEQUENCE_OF’
  A_SEQUENCE_OF(struct MemberL {
  ^~~~~~~~~~~~~
/build/deps/install/stow/osmo-iuh/include/osmocom/ranap/RANAP_PLMNs-in-shared-network.h:27:23: warning: ‘struct MemberM’ declared inside parameter list will not be visible outside of this definition or declaration
  A_SEQUENCE_OF(struct MemberM {
                       ^
/build/deps/install/stow/libasn1c/include/asn1c/asn_SET_OF.h:17:16: note: in definition of macro ‘A_SET_OF’
   void (*free)(type *);   \
                ^~~~
/build/deps/install/stow/osmo-iuh/include/osmocom/ranap/RANAP_PLMNs-in-shared-network.h:27:2: note: in expansion of macro ‘A_SEQUENCE_OF’
  A_SEQUENCE_OF(struct MemberM {
  ^~~~~~~~~~~~~
/build/deps/install/stow/osmo-iuh/include/osmocom/ranap/RANAP_RABDataVolumeReport.h:27:23: warning: ‘struct MemberN’ declared inside parameter list will not be visible outside of this definition or declaration
  A_SEQUENCE_OF(struct MemberN {
                       ^
/build/deps/install/stow/libasn1c/include/asn1c/asn_SET_OF.h:17:16: note: in definition of macro ‘A_SET_OF’
   void (*free)(type *);   \
                ^~~~
/build/deps/install/stow/osmo-iuh/include/osmocom/ranap/RANAP_RABDataVolumeReport.h:27:2: note: in expansion of macro ‘A_SEQUENCE_OF’
  A_SEQUENCE_OF(struct MemberN {
  ^~~~~~~~~~~~~
/build/deps/install/stow/osmo-iuh/include/osmocom/ranap/RANAP_RABParametersList.h:29:23: warning: ‘struct MemberB’ declared inside parameter list will not be visible outside of this definition or declaration
  A_SEQUENCE_OF(struct MemberB {
                       ^
/build/deps/install/stow/libasn1c/include/asn1c/asn_SET_OF.h:17:16: note: in definition of macro ‘A_SET_OF’
   void (*free)(type *);   \
                ^~~~
/build/deps/install/stow/osmo-iuh/include/osmocom/ranap/RANAP_RABParametersList.h:29:2: note: in expansion of macro ‘A_SEQUENCE_OF’
  A_SEQUENCE_OF(struct MemberB {
  ^~~~~~~~~~~~~
/build/deps/install/stow/osmo-iuh/include/osmocom/ranap/RANAP_UnsuccessfulLinking-IEs.h:27:23: warning: ‘struct MemberD’ declared inside parameter list will not be visible outside of this definition or declaration
  A_SEQUENCE_OF(struct MemberD {
                       ^
/build/deps/install/stow/libasn1c/include/asn1c/asn_SET_OF.h:17:16: note: in definition of macro ‘A_SET_OF’
   void (*free)(type *);   \
                ^~~~
/build/deps/install/stow/osmo-iuh/include/osmocom/ranap/RANAP_UnsuccessfulLinking-IEs.h:27:2: note: in expansion of macro ‘A_SEQUENCE_OF’
  A_SEQUENCE_OF(struct MemberD {
  ^~~~~~~~~~~~~
In file included from /build/deps/install/stow/osmo-iuh/include/osmocom/ranap/ranap_common.h:592:0,
                 from /build/deps/install/stow/osmo-iuh/include/osmocom/ranap/ranap_ies_defs.h:7,
                 from ../../include/osmocom/sgsn/gprs_ranap.h:7,
                 from sgsn_libgtp.c:55:
/build/deps/install/stow/osmo-iuh/include/osmocom/ranap/ranap_ies_defs.h:462:0: warning: "ENHANCEDRELOCATIONCOMPLETEREQUESTIES_RANAP_EXTENDEDRNC_ID_PRESENT" redefined
 #define ENHANCEDRELOCATIONCOMPLETEREQUESTIES_RANAP_EXTENDEDRNC_ID_PRESENT                   (1 << 1)
 
/build/deps/install/stow/osmo-iuh/include/osmocom/ranap/ranap_ies_defs.h:461:0: note: this is the location of the previous definition
 #define ENHANCEDRELOCATIONCOMPLETEREQUESTIES_RANAP_EXTENDEDRNC_ID_PRESENT                   (1 << 0)
 
/build/deps/install/stow/osmo-iuh/include/osmocom/ranap/ranap_ies_defs.h:586:0: warning: "RANAP_ENHANCEDRELOCATIONINFORMATIONREQUESTIES_RANAP_IUSIGNALLINGCONNECTIONIDENTIFIER_PRESENT" redefined
 #define RANAP_ENHANCEDRELOCATIONINFORMATIONREQUESTIES_RANAP_IUSIGNALLINGCONNECTIONIDENTIFIER_PRESENT     (1 << 2)
 
/build/deps/install/stow/osmo-iuh/include/osmocom/ranap/ranap_ies_defs.h:584:0: note: this is the location of the previous definition
 #define RANAP_ENHANCEDRELOCATIONINFORMATIONREQUESTIES_RANAP_IUSIGNALLINGCONNECTIONIDENTIFIER_PRESENT     (1 << 0)
 
/build/deps/install/stow/osmo-iuh/include/osmocom/ranap/ranap_ies_defs.h:587:0: warning: "RANAP_ENHANCEDRELOCATIONINFORMATIONREQUESTIES_RANAP_GLOBALCN_ID_PRESENT" redefined
 #define RANAP_ENHANCEDRELOCATIONINFORMATIONREQUESTIES_RANAP_GLOBALCN_ID_PRESENT                          (1 << 3)
 
/build/deps/install/stow/osmo-iuh/include/osmocom/ranap/ranap_ies_defs.h:585:0: note: this is the location of the previous definition
 #define RANAP_ENHANCEDRELOCATIONINFORMATIONREQUESTIES_RANAP_GLOBALCN_ID_PRESENT                          (1 << 1)
 
sgsn_libgtp.c:111:17: error: conflicting types for ‘imsi_str2gtp’
 static uint64_t imsi_str2gtp(char *str)
                 ^~~~~~~~~~~~
In file included from ../../include/osmocom/sgsn/sgsn.h:20:0,
                 from sgsn_libgtp.c:47:
/build/deps/install/stow/osmo-ggsn/include/gtp.h:444:23: note: previous declaration of ‘imsi_str2gtp’ was here
 extern const uint64_t imsi_str2gtp(const char *imsi);
                       ^~~~~~~~~~~~
sgsn_libgtp.c: In function ‘sgsn_gtp_init’:
sgsn_libgtp.c:814:2: warning: ‘gtp_set_cb_recovery2’ is deprecated: Use gtp_set_cb_recovery3() instead, to obtain gsn handling the recovery [-Wdeprecated-declarations]
  gtp_set_cb_recovery2(gsn, cb_recovery2);
  ^~~~~~~~~~~~~~~~~~~~
In file included from ../../include/osmocom/sgsn/sgsn.h:20:0,
                 from sgsn_libgtp.c:47:
/build/deps/install/stow/osmo-ggsn/include/gtp.h:377:5: note: declared here
 int gtp_set_cb_recovery2(struct gsn_t *gsn,
     ^~~~~~~~~~~~~~~~~~~~
make[3]: *** [sgsn_libgtp.o] Error 1
make[3]: *** Waiting for unfinished jobs....
Makefile:536: recipe for target 'sgsn_libgtp.o' failed
make[3]: Leaving directory '/build/src/sgsn'
make[2]: *** [all-recursive] Error 1
Makefile:395: recipe for target 'all-recursive' failed
make[2]: Leaving directory '/build/src'
make[1]: *** [all-recursive] Error 1
Makefile:461: recipe for target 'all-recursive' failed
make[1]: Leaving directory '/build'
Makefile:393: recipe for target 'all' failed
make: *** [all] Error 2
Build step 'Execute shell' marked build as failure
[WARNINGS]Skipping publisher since build result is FAILURE


More information about the jenkins-notifications mailing list