Build failed in Jenkins: master-osmo-gsm-tester » a1=default,a2=default,a3=default,a4=default,osmocom-master-debian9 #544

jenkins at lists.osmocom.org jenkins at lists.osmocom.org
Sat Mar 14 09:05:07 UTC 2020


See <https://jenkins.osmocom.org/jenkins/job/master-osmo-gsm-tester/a1=default,a2=default,a3=default,a4=default,label=osmocom-master-debian9/544/display/redirect>

------------------------------------------
Started by upstream project "master-osmo-gsm-tester" build number 544
originally caused by:
 Started by timer
Running as SYSTEM
Building remotely on build2-deb9build-ansible (ttcn3 osmo-gsm-tester-build osmocom-gerrit-debian9 osmocom-master-debian9 coverity) in workspace <https://jenkins.osmocom.org/jenkins/job/master-osmo-gsm-tester/a1=default,a2=default,a3=default,a4=default,label=osmocom-master-debian9/ws/>
No credentials specified
 > git rev-parse --is-inside-work-tree # timeout=10
Fetching changes from the remote Git repository
 > git config remote.origin.url git://git.osmocom.org/osmo-gsm-tester # timeout=10
Fetching upstream changes from git://git.osmocom.org/osmo-gsm-tester
 > git --version # timeout=10
 > git fetch --tags --progress git://git.osmocom.org/osmo-gsm-tester +refs/heads/*:refs/remotes/origin/*
Checking out Revision 7dc221607136622ecd92f32c2cecfbdabafd53ed (refs/remotes/origin/master)
 > git config core.sparsecheckout # timeout=10
 > git checkout -f 7dc221607136622ecd92f32c2cecfbdabafd53ed
Commit message: "doc/manuals: Write section explaining parametrized scenarios"
 > git rev-list --no-walk 7dc221607136622ecd92f32c2cecfbdabafd53ed # timeout=10
[osmocom-master-debian9] $ /bin/sh -xe /tmp/jenkins7183694362601641220.sh
+ ARTIFACT_STORE=/home/osmocom-build/jenkins_build_artifact_store
+ mkdir -p /home/osmocom-build/jenkins_build_artifact_store
+ docker run --rm=true --cap-add SYS_PTRACE -e ARTIFACT_STORE=/artifact_store -e ASCIIDOC_WARNINGS_CHECK=1 -e HOME=/build -e JOB_NAME=master-osmo-gsm-tester/a1=default,a2=default,a3=default,a4=default,label=osmocom-master-debian9 -e MAKE=make -e OSMOPY_DEBUG_TCP_SOCKETS=1 -e PARALLEL_MAKE=-j 8 -e PATH=/usr/local/bin:/usr/bin:/bin:/usr/games:/home/osmocom-build/bin:/build_bin -e PUBLISH=1 -e WITH_MANUALS=1 -w /build -i -u build -v <https://jenkins.osmocom.org/jenkins/job/master-osmo-gsm-tester/a1=default,a2=default,a3=default,a4=default,label=osmocom-master-debian9/ws/>:/build -v /home/osmocom-build/bin:/build_bin -v /home/osmocom-build/jenkins_build_artifact_store:/artifact_store -v /home/osmocom-build/.ssh:/home/build/.ssh:ro osmocom-build/debian-stretch-jenkins /build/contrib/jenkins-build-manuals.sh
+ base=/build
+ export OSMO_GSM_MANUALS_DIR=/build/osmo-gsm-manuals
+ [ -d /build/doc/manuals ]
+ [ -d /build/osmo-gsm-manuals ]
+ git -C /build/osmo-gsm-manuals pull
Already up-to-date.
+ git -C /build/osmo-gsm-manuals checkout -f HEAD
Your branch is up-to-date with 'origin/master'.
+ temp=/build/_manuals_temp
+ [ -d /build/_manuals_temp ]
+ rm -rf /build/_manuals_temp
+ cp -r /build/doc/manuals /build/_manuals_temp
+ cd /build/_manuals_temp
+ make
OSMO_GSM_MANUALS_DIR: /build/osmo-gsm-manuals (from env)
ln -s /build/osmo-gsm-manuals/build build
ln -s /build/osmo-gsm-manuals/common common
# a2x can't use a different output file. To support out-of-tree builds,
# we create a symlink at /srcfile.adoc pointing at
# /build/_manuals_temp/srcfile.adoc. osmo-gsm-tester-manual.adoc is the /build/_manuals_temp/srcfile.adoc,
#  is like basename from coreutils, and  is WD.
if ! [ -f osmo-gsm-tester-manual.adoc ]; then \
	ln -s osmo-gsm-tester-manual.adoc osmo-gsm-tester-manual.adoc; \
fi
# TEXINPUTS: find LaTeX includes like \includegraphics{./common/images/sysmocom.pdf}
# in /build/osmo-gsm-manuals.
TEXINPUTS="/build/osmo-gsm-manuals" \
	a2x -vv -L --asciidoc-opts="-f /build/osmo-gsm-manuals/build/mscgen-filter.conf -f /build/osmo-gsm-manuals/build/diag-filter.conf -f /build/osmo-gsm-manuals/build/docinfo-releaseinfo.conf -a srcdir='/build/_manuals_temp' -a commondir='/build/osmo-gsm-manuals/common'" --dblatex-opts="-s /build/osmo-gsm-manuals/build/custom-dblatex.sty -P draft.mode=yes -P draft.watermark=0" -a docinfo -a revnumber="DRAFT 0.1-752-g7dc2" -a revdate="2020-Mar-11" osmo-gsm-tester-manual.adoc
a2x: args: ['-vv', '-L', "--asciidoc-opts=-f /build/osmo-gsm-manuals/build/mscgen-filter.conf -f /build/osmo-gsm-manuals/build/diag-filter.conf -f /build/osmo-gsm-manuals/build/docinfo-releaseinfo.conf -a srcdir='/build/_manuals_temp' -a commondir='/build/osmo-gsm-manuals/common'", '--dblatex-opts=-s /build/osmo-gsm-manuals/build/custom-dblatex.sty -P draft.mode=yes -P draft.watermark=0', '-a', 'docinfo', '-a', 'revnumber=DRAFT 0.1-752-g7dc2', '-a', 'revdate=2020-Mar-11', 'osmo-gsm-tester-manual.adoc']
a2x: resource files: []
a2x: resource directories: ['/etc/asciidoc/images', '/etc/asciidoc/stylesheets']
a2x: executing: "/usr/bin/asciidoc" --backend docbook -a "a2x-format=pdf" -f /build/osmo-gsm-manuals/build/mscgen-filter.conf -f /build/osmo-gsm-manuals/build/diag-filter.conf -f /build/osmo-gsm-manuals/build/docinfo-releaseinfo.conf -a srcdir='/build/_manuals_temp' -a commondir='/build/osmo-gsm-manuals/common' --attribute "docinfo" --attribute "revnumber=DRAFT 0.1-752-g7dc2" --attribute "revdate=2020-Mar-11" --verbose  --out-file "/build/_manuals_temp/osmo-gsm-tester-manual.xml" "/build/_manuals_temp/osmo-gsm-tester-manual.adoc"

asciidoc: reading: /etc/asciidoc/asciidoc.conf
asciidoc: reading: /build/osmo-gsm-manuals/build/mscgen-filter.conf
asciidoc: reading: /build/osmo-gsm-manuals/build/diag-filter.conf
asciidoc: reading: /build/osmo-gsm-manuals/build/docinfo-releaseinfo.conf
asciidoc: reading: /etc/asciidoc/asciidoc.conf
asciidoc: reading: /build/_manuals_temp/osmo-gsm-tester-manual.adoc
asciidoc: reading: /etc/asciidoc/docbook45.conf
asciidoc: reading: /etc/asciidoc/filters/code/code-filter.conf
asciidoc: reading: /etc/asciidoc/filters/graphviz/graphviz-filter.conf
asciidoc: reading: /etc/asciidoc/filters/source/source-highlight-filter.conf
asciidoc: reading: /etc/asciidoc/filters/music/music-filter.conf
asciidoc: reading: /etc/asciidoc/filters/latex/latex-filter.conf
asciidoc: reading: /etc/asciidoc/lang-en.conf
asciidoc: reading: /build/osmo-gsm-manuals/build/mscgen-filter.conf
asciidoc: reading: /build/osmo-gsm-manuals/build/diag-filter.conf
asciidoc: reading: /build/osmo-gsm-manuals/build/docinfo-releaseinfo.conf
asciidoc: writing: /build/_manuals_temp/osmo-gsm-tester-manual.xml
asciidoc: osmo-gsm-tester-manual.adoc: line 5: evaluating: {include:/build/_manuals_temp/osmo-gsm-tester-manual-docinfo.xml}
asciidoc: include: /build/_manuals_temp/chapters/intro.adoc
asciidoc: osmo-gsm-tester-manual.adoc: line 13: reading: /build/_manuals_temp/chapters/intro.adoc
asciidoc: intro.adoc: line 55: evaluating: {counter2:target-number}
asciidoc: intro.adoc: line 55: evaluating: {set2:target:osmo-gsm-tester-manual__1.png}
asciidoc: intro.adoc: line 103: filtering: "/usr/bin/python" "/etc/asciidoc/filters/graphviz/graphviz2png.py" -v -o "/build/_manuals_temp/osmo-gsm-tester-manual__1.png" -L dot -F png -
Execute: dot -Tpng "/build/_manuals_temp/osmo-gsm-tester-manual__1.txt" > "/build/_manuals_temp/osmo-gsm-tester-manual__1.png"
asciidoc: include: /build/_manuals_temp/chapters/trial.adoc
asciidoc: osmo-gsm-tester-manual.adoc: line 15: reading: /build/_manuals_temp/chapters/trial.adoc
asciidoc: trial.adoc: line 14: evaluating: {counter2:target-number}
asciidoc: trial.adoc: line 14: evaluating: {set2:target:osmo-gsm-tester-manual__2.png}
asciidoc: trial.adoc: line 25: filtering: "/usr/bin/python" "/etc/asciidoc/filters/graphviz/graphviz2png.py" -v -o "/build/_manuals_temp/osmo-gsm-tester-manual__2.png" -L dot -F png -
Execute: dot -Tpng "/build/_manuals_temp/osmo-gsm-tester-manual__2.txt" > "/build/_manuals_temp/osmo-gsm-tester-manual__2.png"
asciidoc: include: /build/_manuals_temp/chapters/config.adoc
asciidoc: osmo-gsm-tester-manual.adoc: line 17: reading: /build/_manuals_temp/chapters/config.adoc
asciidoc: include: /build/_manuals_temp/chapters/resource_pool.adoc
asciidoc: osmo-gsm-tester-manual.adoc: line 19: reading: /build/_manuals_temp/chapters/resource_pool.adoc
asciidoc: resource_pool.adoc: line 14: evaluating: {counter2:target-number}
asciidoc: resource_pool.adoc: line 14: evaluating: {set2:target:osmo-gsm-tester-manual__3.png}
asciidoc: resource_pool.adoc: line 79: filtering: "/usr/bin/python" "/etc/asciidoc/filters/graphviz/graphviz2png.py" -v -o "/build/_manuals_temp/osmo-gsm-tester-manual__3.png" -L dot -F png -
Execute: dot -Tpng "/build/_manuals_temp/osmo-gsm-tester-manual__3.txt" > "/build/_manuals_temp/osmo-gsm-tester-manual__3.png"
asciidoc: include: /build/_manuals_temp/chapters/test_api.adoc
asciidoc: osmo-gsm-tester-manual.adoc: line 21: reading: /build/_manuals_temp/chapters/test_api.adoc
asciidoc: include: /build/_manuals_temp/chapters/install.adoc
asciidoc: osmo-gsm-tester-manual.adoc: line 23: reading: /build/_manuals_temp/chapters/install.adoc
asciidoc: WARNING: install.adoc: line 450: section title out of sequence: expected level 3, got level 4
asciidoc: include: /build/_manuals_temp/chapters/install_device.adoc
asciidoc: osmo-gsm-tester-manual.adoc: line 25: reading: /build/_manuals_temp/chapters/install_device.adoc
asciidoc: include: /build/_manuals_temp/chapters/ansible.adoc
asciidoc: osmo-gsm-tester-manual.adoc: line 27: reading: /build/_manuals_temp/chapters/ansible.adoc
asciidoc: include: /build/_manuals_temp/chapters/docker.adoc
asciidoc: osmo-gsm-tester-manual.adoc: line 29: reading: /build/_manuals_temp/chapters/docker.adoc
asciidoc: include: /build/_manuals_temp/chapters/debugging.adoc
asciidoc: osmo-gsm-tester-manual.adoc: line 31: reading: /build/_manuals_temp/chapters/debugging.adoc
asciidoc: include: /build/_manuals_temp/chapters/troubleshooting.adoc
asciidoc: osmo-gsm-tester-manual.adoc: line 33: reading: /build/_manuals_temp/chapters/troubleshooting.adoc

a2x: executing: "dblatex" -t pdf -p "/etc/asciidoc/dblatex/asciidoc-dblatex.xsl" -s "/etc/asciidoc/dblatex/asciidoc-dblatex.sty" -s /build/osmo-gsm-manuals/build/custom-dblatex.sty -P draft.mode=yes -P draft.watermark=0 -V  "/build/_manuals_temp/osmo-gsm-tester-manual.xml"

Build the book set list...
xsltproc -o doclist.txt --xinclude --xincludestyle doclist.xsl /build/_manuals_temp/osmo-gsm-tester-manual.xml
Build the listings...
xsltproc -o listings.xml --xinclude --xincludestyle --param current.dir '/build/_manuals_temp' /usr/share/dblatex/xsl/common/mklistings.xsl /build/_manuals_temp/osmo-gsm-tester-manual.xml
xsltproc -o osmo-gsm-tester-manual.rtex --xinclude --xincludestyle --param current.dir '/build/_manuals_temp' --param listings.xml '/tmp/tmp7joB8h/listings.xml' /tmp/tmp7joB8h/custom.xsl /build/_manuals_temp/osmo-gsm-tester-manual.xml
XSLT stylesheets DocBook - LaTeX 2e (0.3.9-3)
===================================================
Error: no ID for constraint linkend: resources_conf_example.
XRef to nonexistent id: resources_conf_example
Image 'dblatex' not found
Cannot convert 'osmo-gsm-tester-manual__1.png' to pdf
Cannot convert 'osmo-gsm-tester-manual__2.png' to pdf
Cannot convert 'osmo-gsm-tester-manual__3.png' to pdf
Build osmo-gsm-tester-manual.pdf
built-in module pdftex registered
no support found for ifthen
no support found for ifxetex
no support found for fontspec
no support found for xltxtra
no support found for fontenc
no support found for inputenc
no support found for fancybox
built-in module makeidx registered
no support found for custom-dblatex
building additional files...
checking if compiling is necessary...
the output file doesn't exist
pdflatex -interaction=batchmode osmo-gsm-tester-manual.tex
running post-compilation scripts...
[index] the index file /tmp/tmp7joB8h/osmo-gsm-tester-manual.idx is empty
osmo-gsm-tester-manual.toc MD5 checksum changed
osmo-gsm-tester-manual.aux MD5 checksum changed
the /tmp/tmp7joB8h/osmo-gsm-tester-manual.toc file has changed
pdflatex -interaction=batchmode osmo-gsm-tester-manual.tex
running post-compilation scripts...
[index] the index file /tmp/tmp7joB8h/osmo-gsm-tester-manual.idx is empty
no new compilation is needed
running last-compilation scripts...
'osmo-gsm-tester-manual.pdf' successfully built

a2x: deleting /build/_manuals_temp/osmo-gsm-tester-manual.xml
+ make check
OSMO_GSM_MANUALS_DIR: /build/osmo-gsm-manuals (from env)
if [ -n "$ASCIIDOC_WARNINGS_CHECK" ]; then \
	make osmo-gsm-tester-manual.check; \
fi
make[1]: Entering directory '/build/_manuals_temp'
OSMO_GSM_MANUALS_DIR: /build/osmo-gsm-manuals (from env)
# out-of-tree building: use a symlink to the output file like done in
# the non-check build above, so the relative include paths work the
# same.
if ! [ -f osmo-gsm-tester-manual.adoc ]; then \
	ln -s osmo-gsm-tester-manual.adoc osmo-gsm-tester-manual.adoc; \
fi
asciidoc -v -f /build/osmo-gsm-manuals/build/mscgen-filter.conf -f /build/osmo-gsm-manuals/build/diag-filter.conf -f /build/osmo-gsm-manuals/build/docinfo-releaseinfo.conf -a srcdir='/build/_manuals_temp' -a commondir='/build/osmo-gsm-manuals/common' osmo-gsm-tester-manual.adoc > osmo-gsm-tester-manual.check 2>&1
# Make absolutely sure that the %.check target is updated.
touch osmo-gsm-tester-manual.check
# Do print the WARNING output but return error if any was found
# (grep -v would omit the WARNING output from the log).
asciidoc: WARNING: install.adoc: line 450: section title out of sequence: expected level 3, got level 4
/build/osmo-gsm-manuals/build/Makefile.asciidoc.inc:90: recipe for target 'osmo-gsm-tester-manual.check' failed
make[1]: Leaving directory '/build/_manuals_temp'
make[1]: *** [osmo-gsm-tester-manual.check] Error 1
make: *** [check] Error 2
/build/osmo-gsm-manuals/build/Makefile.asciidoc.inc:80: recipe for target 'check' failed
Build step 'Execute shell' marked build as failure
[WARNINGS]Skipping publisher since build result is FAILURE


More information about the jenkins-notifications mailing list