Build failure of network:osmocom:nightly/simtrace2 in xUbuntu_20.10/x86_64

OBS Notification admin at opensuse.org
Sat Mar 6 02:12:05 UTC 2021


Visit https://build.opensuse.org/package/live_build_log/network:osmocom:nightly/simtrace2/xUbuntu_20.10/x86_64

Package network:osmocom:nightly/simtrace2 failed to build in xUbuntu_20.10/x86_64

Check out the package for editing:
  osc checkout network:osmocom:nightly simtrace2

Last lines of build log:
[  155s] [COMPILING libboard/qmod/source/board_qmod.c]
[  155s] [COMPILING libboard/qmod/source/card_pres.c]
[  155s] [COMPILING libboard/qmod/source/i2c.c]
[  156s] [COMPILING libboard/qmod/source/wwan_led.c]
[  156s] [COMPILING libboard/qmod/source/wwan_perst.c]
[  156s] [COMPILING apps/dfu/main.c]
[  156s] [COMPILING ./atmel_softpack_libraries/usb/device/dfu/dfu.c]
[  156s] [COMPILING ./atmel_softpack_libraries/usb/device/dfu/dfu_desc.c]
[  156s] [COMPILING ./atmel_softpack_libraries/usb/device/dfu/dfu_driver.c]
[  156s] Memory region         Used Size  Region Size  %age Used
[  156s]              rom:       16592 B        16 KB    101.27%
[  156s]              ram:       11680 B        48 KB     23.76/usr/lib/gcc/arm-none-eabi/9.2.1/../../../arm-none-eabi/bin/ld: bin/qmod-dfu-flash.elf section `.text' will not fit in region `rom'
[  156s] /usr/lib/gcc/arm-none-eabi/9.2.1/../../../arm-none-eabi/bin/ld: region `rom' overflowed by 208 bytes
[  156s] collect2: error: ld returned 1 exit status
[  156s] %
[  156s] make[2]: *** [Makefile:234: flash] Error 1
[  156s] make[2]: Leaving directory '/usr/src/packages/BUILD/firmware'
[  156s] make[1]: *** [Makefile:13: fw-qmod-dfu] Error 2
[  156s] make[1]: Leaving directory '/usr/src/packages/BUILD'
[  156s] dh_auto_build: error: make -j1 returned exit code 2
[  156s] make: *** [debian/rules:16: build] Error 25
[  156s] dpkg-buildpackage: error: debian/rules build subprocess returned exit status 2
[  156s] ### VM INTERACTION START ###
[  159s] [  147.379348] sysrq: Power Off
[  159s] [  147.386588] reboot: Power down
[  160s] ### VM INTERACTION END ###
[  160s] 
[  160s] lamb14 failed "build simtrace2_0.7.0.74.199c.dsc" at Sat Mar  6 02:11:53 UTC 2021.
[  160s] 

-- 
Configure notifications at https://build.opensuse.org/my/subscriptions
openSUSE Build Service (https://build.opensuse.org/)


More information about the gerrit-log mailing list