Build failure of network:osmocom:nightly/simtrace2 in xUbuntu_20.10/x86_64

OBS Notification admin at opensuse.org
Fri Mar 5 01:37:31 UTC 2021


Visit https://build.opensuse.org/package/live_build_log/network:osmocom:nightly/simtrace2/xUbuntu_20.10/x86_64

Package network:osmocom:nightly/simtrace2 failed to build in xUbuntu_20.10/x86_64

Check out the package for editing:
  osc checkout network:osmocom:nightly simtrace2

Last lines of build log:
[   83s] [COMPILING apps/dfu/main.c]
[   83s] [COMPILING ./atmel_softpack_libraries/usb/device/dfu/dfu.c]
[   83s] [COMPILING ./atmel_softpack_libraries/usb/device/dfu/dfu_desc.c]
[   84s] [COMPILING ./atmel_softpack_libraries/usb/device/dfu/dfu_driver.c]
[   84s] Memory region         Used Size  Region Size  %age Used
[   84s]              rom:       16580 B        16 KB    101.20%
[   84s]              ram:       11672 B        48 KB     23.75/usr/lib/gcc/arm-none-eabi/9.2.1/../../../arm-none-eabi/bin/ld: warning: changing start of section .stack by 4 bytes
[   84s] /usr/lib/gcc/arm-none-eabi/9.2.1/../../../arm-none-eabi/bin/ld: warning: changing start of section .stack by 4 bytes
[   84s] /usr/lib/gcc/arm-none-eabi/9.2.1/../../../arm-none-eabi/bin/ld: bin/qmod-dfu-flash.elf section `.text' will not fit in region `rom'
[   84s] /usr/lib/gcc/arm-none-eabi/9.2.1/../../../arm-none-eabi/bin/ld: warning: changing start of section .stack by 4 bytes
[   84s] /usr/lib/gcc/arm-none-eabi/9.2.1/../../../arm-none-eabi/bin/ld: warning: changing start of section .stack by 4 bytes
[   84s] /usr/lib/gcc/arm-none-eabi/9.2.1/../../../arm-none-eabi/bin/ld: warning: changing start of section .stack by 4 bytes
[   84s] /usr/lib/gcc/arm-none-eabi/9.2.1/../../../arm-none-eabi/bin/ld: region `rom' overflowed by 196 bytes
[   84s] collect2: error: ld returned 1 exit status
[   84s] %
[   84s] make[2]: *** [Makefile:234: flash] Error 1
[   84s] make[2]: Leaving directory '/usr/src/packages/BUILD/firmware'
[   84s] make[1]: *** [Makefile:13: fw-qmod-dfu] Error 2
[   84s] make[1]: Leaving directory '/usr/src/packages/BUILD'
[   84s] dh_auto_build: error: make -j1 returned exit code 2
[   84s] make: *** [debian/rules:16: build] Error 25
[   84s] dpkg-buildpackage: error: debian/rules build subprocess returned exit status 2
[   84s] ### VM INTERACTION START ###
[   87s] [   79.405580] sysrq: Power Off
[   87s] [   79.412813] reboot: Power down
[   87s] ### VM INTERACTION END ###
[   87s] 
[   87s] goat15 failed "build simtrace2_0.7.0.70.657c.dsc" at Fri Mar  5 01:37:30 UTC 2021.
[   87s] 

-- 
Configure notifications at https://build.opensuse.org/my/subscriptions
openSUSE Build Service (https://build.opensuse.org/)


More information about the gerrit-log mailing list