Build failure of network:osmocom:nightly/openbsc in xUbuntu_19.04/x86_64

OBS Notification admin at opensuse.org
Wed May 22 02:49:10 UTC 2019


Visit https://build.opensuse.org/package/live_build_log/network:osmocom:nightly/openbsc/xUbuntu_19.04/x86_64

Package network:osmocom:nightly/openbsc failed to build in xUbuntu_19.04/x86_64

Check out the package for editing:
  osc checkout network:osmocom:nightly openbsc

Last lines of build log:
[  186s] | configure: exit 0
[  186s] 
[  186s] #                             -*- compilation -*-
[  186s] 4. testsuite.at:23: testing db ...
[  186s] ./testsuite.at:28: $abs_top_builddir/tests/db/db_test
[  186s] --- expout	2019-05-22 02:48:51.474384986 +0000
[  186s] +++ /usr/src/packages/BUILD/openbsc/tests/testsuite.dir/at-groups/4/stdout	2019-05-22 02:48:51.690384993 +0000
[  186s] @@ -1,4 +1,6 @@
[  186s]  Testing subscriber database code.
[  186s]  DB: Database initialized.
[  186s] +no tables in statement !
[  186s] +no tables in statement !
[  186s]  DB: Database prepared.
[  186s]  Done
[  186s] 4. testsuite.at:23: 4. db (testsuite.at:23): FAILED (testsuite.at:28)
[  186s] make[1]: *** [debian/rules:30: override_dh_auto_test] Error 1
[  186s] make[1]: Leaving directory '/usr/src/packages/BUILD'
[  186s] make: *** [debian/rules:13: build] Error 2
[  186s] dpkg-buildpackage: error: debian/rules build subprocess returned exit status 2
[  186s] 
[  186s] cloud114 failed "build openbsc_1.2.0.20190522.dsc" at Wed May 22 02:48:53 UTC 2019.
[  186s] 
[  186s] ### VM INTERACTION START ###
[  189s] [  167.752255] sysrq: SysRq : Power Off
[  189s] [  167.766026] reboot: Power down
[  192s] ### VM INTERACTION END ###
[  192s] 
[  192s] cloud114 failed "build openbsc_1.2.0.20190522.dsc" at Wed May 22 02:49:00 UTC 2019.
[  192s] 

-- 
Configure notifications at https://build.opensuse.org/user/notifications
openSUSE Build Service (https://build.opensuse.org/)


More information about the gerrit-log mailing list